program: Gaussian 09
title: 000281507
version: EM64L-G09RevD.01
frameworkgroup: C1[X(C10H16N2O2)]
method: RPBEPBE
basis: SDD
operation: Freq
keyword: #p
keyword: freq=noraman
keyword: PBEPBE/SDD
title: #p freq=noraman PBEPBE/SDD
converged: YES YES NO NO
title: Mulliken charges:
elementType: O O N N C C C C C C C C C C H H H H H H H H H H H H H H H H
charge: -0.423690 -0.253835 -0.368883 -0.011397 0.407701 0.191678 -0.545865 -0.491828 -0.783656 -0.504961 -0.754494 0.114448 -0.451536 -0.164032 0.235703 0.221241 0.239481 0.252354 0.262221 0.216570 0.203165 0.245799 0.257689 0.323400 0.249690 0.238123 0.237291 0.262991 0.255726 0.338908
chargesum: 0.00000
title: Mulliken charges with hydrogens summed into heavy atoms:
elementType: O O N N C C C C C C C C C C
charge: -0.084782 -0.253835 -0.045482 -0.011397 0.407701 0.191678 -0.088922 0.000007 -0.101700 -0.001473 -0.029392 0.114448 0.067181 -0.164032
polarizability: 1.30095908e+02 -2.45308883e-02 1.22836713e+02 -4.09374364e+00 2.76949185e-01 1.08116076e+02
1716.lowfreq: -12.2609 -5.8411 -0.0012 -0.0009 -0.0009 15.7407 40.0645 73.9509 87.5307
frequency: 39.9477 73.8704 87.5161 92.4099 105.3267 176.9957 193.4899 229.6482 234.5347 252.0422 277.3014 293.6667 314.1314 334.5186 343.2624 368.6003 379.6773 420.0281 456.6657 479.8291 494.5039 526.1014 539.7630 567.9708 651.7040 684.7070 719.3691 760.3460 773.9018 811.8872 860.2003 908.6021 917.0047 939.9643 963.2639 981.7657 1004.5744 1030.0937 1046.7402 1058.4049 1105.1189 1116.7709 1131.3050 1155.8402 1182.0121 1224.3443 1234.8793 1241.8729 1282.3600 1292.2899 1299.9299 1317.5714 1326.4459 1346.4268 1351.8448 1388.4088 1395.9682 1415.9642 1442.6564 1451.9911 1465.6556 1469.1676 1477.8998 1488.2255 1489.8701 1496.0947 1626.7720 2198.7121 2982.5402 2985.9435 2994.4472 2996.6329 3007.1891 3009.7440 3036.3372 3046.6309 3066.6078 3071.8962 3073.6792 3097.0457 3101.8844 3123.7641 3492.4457 3557.6161
redmass: 6.4595 3.5231 4.7266 2.4401 4.5446 1.6463 1.8377 1.6881 1.6280 1.2877 3.2783 2.4498 3.6061 2.7164 3.1289 3.4979 3.0253 2.8706 3.4694 3.6587 2.6802 3.3138 3.4227 3.7209 3.4189 3.0166 1.5092 1.4787 1.7221 3.4273 2.5112 2.1839 2.2863 3.4804 1.6273 1.6058 1.9346 2.9848 1.8633 1.9454 1.8321 2.1259 1.7941 1.6843 2.4757 1.5022 1.9436 1.5901 1.5058 1.6315 1.2081 1.5631 1.9030 1.5644 2.1615 1.2138 1.2408 1.6522 1.0856 1.0879 1.0587 1.0533 1.0662 1.0666 1.0707 1.0676 6.0066 12.4292 1.0577 1.0430 1.0645 1.0601 1.0502 1.0456 1.0967 1.0999 1.0962 1.0997 1.1019 1.0986 1.0981 1.1005 1.0757 1.0658
irintensity: 5.2853 4.7693 7.9788 1.1842 2.3494 1.0983 5.5098 34.2130 10.7872 61.6636 7.0722 1.7068 1.8545 9.7030 2.3501 5.6952 6.1068 13.1305 5.2099 2.7819 1.6973 15.8879 7.1906 4.8293 1.5001 5.3815 96.4761 5.8748 10.3711 16.0940 74.4883 10.9034 3.7201 2.6147 1.2547 2.8292 5.2122 7.2750 11.9224 48.7575 34.4529 22.6296 3.5955 6.8509 84.9376 4.3378 2.0706 20.9816 7.5169 55.5322 0.3243 15.0148 50.1810 12.8353 76.6079 21.8671 44.0108 38.7432 1.6117 13.3839 4.6283 12.5477 5.5575 2.5699 3.9274 35.2437 348.1877 15.1244 21.9221 35.7244 7.1518 6.1463 2.8621 23.3726 35.4863 0.1777 19.8414 24.8317 31.4516 9.1913 25.4098 14.8206 15.6672 8.2445
temp: 298.150 k
press: 1.00000 atm
elementType: 8 8 7 7 6 6 6 6 6 6 6 6 6 6 1 1 1 1 1 1 1 1 1 1 1 1 1 1 1 1
symmnumber: 1
zpe: 654687.1 jmol-1
zpe.correction: 0.249357 hartree
zpe.thermalcorrener: 0.264364 hartree
zpe.thermalcorrenthalpy: 0.265308 hartree
zpe.thermalcorrgfe: 0.207967 hartree
zpe.sumelectzpe: -649.525128 hartree
zpe.sumelectthermal: -649.510122 hartree
zpe.sumelectthermalent: -649.509177 hartree
zpe.sumelectthermalfe: -649.566518 hartree
dipole: -1.5366 -3.3591 3.0311
dipole: 4.7783
quadrupole: -111.2636 -98.8348 -79.5113
quadrupole: 0.3652 7.4750 6.6387
quadrupole: -14.7270 -2.2983 17.0253 0.3652 7.4750 6.6387
hfenergy: -649.7744852 hartree
pointgroup: C01 [X(C10H16N2O2)]
dipole: -0.5557603 -1.337654 1.1983225 debye
polarizability: 130.07224|0.2139049|122.8445625|-4.1458094|0.0823283|108.1318943 unknown
InChI: InChI=1S/C10H16N2O2/c1-9(5-3-7-11)6-4-8(13)12-10(9,2)14/h12,14H,3-6H2,1-2H3
charge 0 multiplicity 1
30 atoms
O  -2.36318 -1.704788 0.251002
O  -2.323021 2.60022 -0.556389
N  -1.785895 0.367358 -0.852966
N  4.492843 0.83344 -1.013385
C  -0.021161 -0.79636 0.491088
C  -1.280088 -0.959477 -0.456339
C  -0.435117 0.190453 1.623586
C  1.183423 -0.249163 -0.341672
C  0.342329 -2.166948 1.116022
C  -0.815062 1.586718 1.089706
C  -1.03857 -1.811675 -1.710882
C  -1.708184 1.571386 -0.151037
C  2.430449 0.113611 0.515863
C  3.573998 0.513598 -0.322203
H  0.38032 0.282193 2.364508
H  -1.284778 -0.250548 2.182136
H  1.489296 -1.019392 -1.072307
H  0.884019 0.639986 -0.926327
H  -0.562123 -2.663253 1.505064
H  0.811395 -2.843291 0.37873
H  1.051631 -2.040824 1.954568
H  0.089246 2.164978 0.814795
H  -1.333558 2.189925 1.855421
H  -2.398136 0.395072 -1.675935
H  -0.706741 -2.82235 -1.426079
H  -1.989025 -1.920016 -2.26232
H  -0.290363 -1.356019 -2.378563
H  2.739373 -0.749752 1.134485
H  2.205097 0.945578 1.209058
H  -2.820317 -1.080757 0.871274
