program: Gaussian 09
title: 000281494
version: EM64L-G09RevD.01
frameworkgroup: C1[X(C12H13NO2)]
method: RPBEPBE
basis: SDD
operation: Freq
keyword: #p
keyword: freq=noraman
keyword: PBEPBE/SDD
title: #p freq=noraman PBEPBE/SDD
converged: NO YES NO NO
title: Mulliken charges:
elementType: O O N C C C C C C C C C C C C H H H H H H H H H H H H H
charge: -0.302952 -0.298634 -0.017325 0.117214 -0.525549 -0.527099 0.492344 -0.206425 -0.561075 -0.416711 0.235016 -0.332850 0.182268 -0.530679 -0.530510 0.260558 0.253344 0.254739 0.260875 0.269497 0.247189 0.252672 0.255244 0.222014 0.232901 0.254950 0.227577 0.231408
chargesum: 0.00000
title: Mulliken charges with hydrogens summed into heavy atoms:
elementType: O O N C C C C C C C C C C C C
charge: -0.302952 -0.298634 -0.017325 0.117214 -0.011647 -0.011485 0.492344 -0.206425 -0.291579 -0.169523 0.235016 -0.080178 0.182268 0.179480 0.183425
polarizability: 1.82601534e+02 -2.88173775e+00 1.27020857e+02 -4.81984577e-01 4.45880058e+00 1.07253248e+02
1716.lowfreq: -18.8880 -11.4961 -6.4549 -0.0005 0.0000 0.0008 2.7736 49.0293 78.6671
frequency: -6.6184 49.0185 78.6508 105.4053 118.4333 126.6112 152.8113 161.1264 171.9157 193.0529 211.7563 246.9599 304.5595 327.1938 345.5693 360.7034 438.3642 454.6775 492.1024 538.5123 563.3086 585.0118 623.5431 655.9311 709.0261 750.7097 776.2733 806.8066 836.0310 864.8200 883.3749 899.6017 940.4049 945.9053 948.9461 958.1214 979.0505 1064.8069 1080.6402 1083.3248 1103.9608 1111.8045 1114.6552 1151.8416 1152.4773 1169.7925 1172.8334 1219.2933 1246.9919 1257.7981 1317.6546 1356.0391 1394.3122 1422.8867 1441.4114 1442.1339 1457.7597 1459.9296 1462.6520 1476.6072 1486.5420 1487.6935 1569.3626 1611.8414 2181.7694 2974.1398 2977.1435 3071.2081 3074.5708 3106.4021 3115.0783 3124.5236 3125.1563 3141.1936 3153.6795 3166.9884 3210.5240 3226.7834
redmass: 5.1474 4.1905 4.0717 2.7292 4.2625 3.6205 1.5813 1.0966 2.1654 3.1048 2.5525 5.0463 4.6101 5.6300 5.0381 4.9699 4.3920 5.0207 3.6391 6.5243 5.7209 5.0968 5.8017 4.2634 5.8053 3.3588 1.5914 1.7412 1.5005 6.1751 2.9023 1.6209 4.1292 1.5590 2.7376 1.3908 4.3990 1.1883 2.1581 1.3701 1.9168 1.2627 1.2427 1.3193 1.3259 1.3152 2.1214 2.4444 1.5663 3.8079 3.5830 7.2658 2.9651 1.1760 1.0861 1.3424 1.0553 1.0680 1.2234 1.0645 2.2048 1.2042 7.6606 6.6904 12.5983 1.0309 1.0306 1.1040 1.1046 1.0508 1.0623 1.1028 1.1030 1.0886 1.0920 1.0965 1.1183 1.1163
irintensity: 2.3567 1.6964 6.7585 7.7406 0.3279 0.5989 1.1415 0.0341 0.5540 9.3426 0.2453 11.3646 2.2801 1.2285 1.1705 1.9193 4.6050 3.3910 6.4769 4.5446 6.3159 4.0503 6.6369 24.0788 10.4720 3.0680 1.9533 4.7094 27.0808 5.9219 4.7886 3.2349 39.7255 20.4898 55.9144 2.1635 53.7410 14.7419 22.8719 13.0138 36.7767 8.5823 5.6087 0.4002 0.2984 0.1446 27.5770 94.3727 38.6949 6.8200 64.6025 22.1686 21.7686 0.5658 13.2570 15.7276 14.3397 7.3147 7.3628 8.2719 61.9045 80.5507 10.2708 5.2293 33.9205 80.1343 58.9443 29.5493 21.7428 8.8411 2.6185 20.2635 24.2003 6.3353 2.9708 5.4111 0.0171 14.0754
temp: 298.150 k
press: 1.00000 atm
elementType: 8 8 7 6 6 6 6 6 6 6 6 6 6 6 6 1 1 1 1 1 1 1 1 1 1 1 1 1
symmnumber: 1
zpe: 577619.8 jmol-1
zpe.correction: 0.220004 hartree
zpe.thermalcorrener: 0.234328 hartree
zpe.thermalcorrenthalpy: 0.235272 hartree
zpe.thermalcorrgfe: 0.178920 hartree
zpe.sumelectzpe: -669.089060 hartree
zpe.sumelectthermal: -669.074736 hartree
zpe.sumelectthermalent: -669.073792 hartree
zpe.sumelectthermalfe: -669.130144 hartree
dipole: -2.5036 1.8666 -3.3601
dipole: 4.5872
quadrupole: -84.7068 -82.7801 -96.6807
quadrupole: 5.0859 -16.0226 1.6776
quadrupole: 3.3491 5.2757 -8.6248 5.0859 -16.0226 1.6776
hfenergy: -669.3090641 hartree
pointgroup: C01 [X(C12H13N1O2)]
dipole: -1.0231871 -0.7686465 1.2725181 debye
polarizability: 182.2245846|4.1354924|127.1540753|3.7487919|4.7876261|107.4969791 unknown
InChI: InChI=1S/C12H13NO2/c1-14-10-4-3-9(7-11(10)15-2)12(8-13)5-6-12/h3-4,7H,5-6H2,1-2H3
charge 0 multiplicity 1
28 atoms
O  -2.157196 -1.531719 -0.824901
O  -3.212774 0.910356 0.41257
N  3.640268 1.055499 -1.866431
C  2.468297 -0.073637 0.225706
C  3.075392 -1.412093 0.72182
C  3.302623 -0.14027 1.533215
C  0.970896 0.150569 0.304852
C  3.114214 0.544928 -0.922332
C  0.076465 -0.782128 -0.269949
C  0.453927 1.312214 0.929334
C  -1.316262 -0.565415 -0.227617
C  -0.936274 1.548812 0.95126
C  -1.828528 0.630291 0.357539
C  -3.116875 -2.180189 0.100472
C  -3.86282 1.075079 -0.911145
H  3.916677 -1.824971 0.159661
H  2.365585 -2.14896 1.107402
H  2.744295 -0.016756 2.465134
H  4.298258 0.310375 1.521541
H  0.444089 -1.695259 -0.749712
H  1.140149 2.03649 1.381414
H  -1.354947 2.449873 1.410287
H  -3.751771 -1.430182 0.604865
H  -2.569299 -2.776781 0.854183
H  -3.727152 -2.843453 -0.530764
H  -3.725914 0.173801 -1.534707
H  -3.443175 1.957391 -1.429094
H  -4.928948 1.23874 -0.6935
