program: Gaussian 09
title: 000025383
version: EM64L-G09RevD.01
frameworkgroup: C1[X(C14H19NO6)]
method: RPBEPBE
basis: SDD
operation: Freq
keyword: #p
keyword: freq=noraman
keyword: PBEPBE/SDD
title: #p freq=noraman PBEPBE/SDD
converged: NO YES NO NO
title: Mulliken charges:
elementType: O O O O O O N C C C C C C C C C C C C C C H H H H H H H H H H H H H H H H H H H
charge: -0.261882 -0.444366 -0.498637 -0.451938 -0.441991 -0.236917 -0.387105 -0.184337 -0.064505 -0.217283 -0.037612 -0.166503 -0.371514 0.448280 -0.348780 -0.436756 -0.353219 -0.341655 0.316022 0.109193 -0.790354 0.261341 0.205373 0.277070 0.226390 0.236164 0.233455 0.183752 0.323726 0.363690 0.377744 0.360927 0.374969 0.257040 0.229561 0.240800 0.278088 0.236580 0.235133 0.260057
chargesum: 0.00000
title: Mulliken charges with hydrogens summed into heavy atoms:
elementType: O O O O O O N C C C C C C C C C C C C C C
charge: -0.261882 -0.080676 -0.120893 -0.091011 -0.067022 -0.236917 -0.063379 0.077004 0.140868 0.059786 0.188778 0.069661 0.045693 0.448280 -0.091741 -0.207195 -0.112419 -0.063567 0.316022 0.109193 -0.058585
polarizability: 2.88873856e+02 9.92984076e+00 1.75756201e+02 4.29419555e+00 -1.44414630e+01 1.14602134e+02
1716.lowfreq: -14.0362 -3.6501 -0.0010 -0.0004 -0.0003 12.6724 27.3602 36.1246 42.0241
frequency: 24.0155 35.9120 41.9822 70.8041 81.5285 92.0860 104.3920 129.8025 139.0554 156.8288 171.7435 186.4778 213.5413 218.9682 254.3544 261.2320 267.6508 311.1115 327.1040 367.0221 374.7728 399.1589 411.9527 433.5528 450.1505 460.0332 477.5605 490.8155 500.3326 509.4203 549.2753 565.1218 571.0046 590.5981 613.8621 627.0476 647.6559 663.1014 714.1461 729.6498 739.7180 799.9245 821.0457 841.3860 842.2794 859.0351 901.5349 934.3016 944.7797 953.9452 967.6313 990.8032 991.9436 999.4044 1012.6721 1025.5716 1026.3146 1044.9115 1066.8121 1073.1375 1097.1217 1118.6919 1123.8624 1158.0037 1175.9933 1192.3822 1198.7064 1227.4203 1239.8239 1252.5167 1262.8339 1270.6435 1284.6777 1295.6342 1304.0911 1314.5204 1319.4971 1334.6751 1345.4853 1361.0071 1365.1010 1369.2176 1378.2795 1382.9519 1385.5408 1410.7385 1434.8059 1447.6031 1464.1841 1479.4866 1484.8155 1524.0929 1568.7032 1593.4521 1628.6353 2937.2952 2947.5903 2966.4936 2969.2894 2984.2553 3041.0662 3068.7459 3070.3449 3085.3052 3121.9099 3123.9502 3141.4897 3158.0852 3165.4284 3439.5054 3470.1147 3489.9455 3525.4766 3536.6986
redmass: 5.5020 5.3638 5.1837 5.5963 4.3252 5.1922 5.2544 5.3503 1.0658 4.2198 6.1192 6.9933 3.5274 4.7975 5.8219 4.7448 4.8005 4.9016 5.0849 5.0585 4.9660 4.8145 2.9582 1.1325 4.5572 3.8754 1.1634 3.5692 2.9236 3.2736 1.1708 3.4827 1.2094 2.2913 2.6252 1.6689 5.7919 3.3127 4.6150 4.7223 3.5125 4.3605 1.4892 1.7051 3.2186 3.2736 1.9192 4.0492 2.2009 1.3637 7.1758 1.3718 5.7569 3.0141 3.0054 1.8168 3.2792 3.2498 2.2118 2.4243 2.9596 1.6735 1.5090 1.2661 1.5925 1.1908 1.7337 1.3895 1.2427 1.3558 1.2427 1.3585 3.3936 1.5691 1.3346 1.3391 1.6335 1.5594 1.2932 1.2727 1.4422 1.2497 1.3688 1.7541 2.1817 1.2038 4.1000 1.1053 1.0500 1.0919 1.8351 3.0182 4.7203 6.5098 6.5246 1.0820 1.0730 1.0816 1.0835 1.0375 1.0853 1.0970 1.0872 1.0945 1.0894 1.0990 1.0874 1.0947 1.0961 1.0662 1.0648 1.0650 1.0766 1.0656
irintensity: 0.3383 2.7516 1.4430 0.8562 4.6311 1.0465 4.8571 2.0600 0.4874 8.8118 0.6770 0.2650 4.1154 16.5680 2.2865 22.5990 7.6421 3.2227 5.3798 6.4572 3.9884 4.6288 1.0292 59.9685 4.2374 7.4197 6.1898 5.5069 29.2328 9.2290 143.5786 33.8385 262.1481 17.4352 28.7053 107.2651 25.0168 82.0055 8.1678 32.5738 0.1894 80.8459 28.0421 35.4832 62.9761 78.0326 17.4874 225.5016 33.2395 0.0131 116.5933 2.5258 66.4406 0.9955 77.1176 1.1467 58.6128 70.3024 41.2056 0.7390 40.9451 15.4027 1.7658 21.8811 45.4969 16.1364 181.1873 57.8161 58.2535 1.5002 21.6504 15.3342 257.7725 86.2849 5.2214 13.6724 116.3838 25.7643 21.4079 31.1219 82.6438 22.8744 50.2702 7.7424 27.6285 100.8023 3.2914 48.1279 20.2650 4.2802 161.3154 262.5550 71.2853 242.4137 224.4548 14.4786 15.7025 58.8486 62.6538 4.2457 17.5104 13.9336 19.3585 27.3238 13.3221 20.5836 10.3946 8.1834 11.0737 81.6892 12.4455 20.1415 70.9219 22.4661
temp: 298.150 k
press: 1.00000 atm
elementType: 8 8 8 8 8 8 7 6 6 6 6 6 6 6 6 6 6 6 6 6 6 1 1 1 1 1 1 1 1 1 1 1 1 1 1 1 1 1 1 1
symmnumber: 1
zpe: 838044.9 jmol-1
zpe.correction: 0.319194 hartree
zpe.thermalcorrener: 0.339959 hartree
zpe.thermalcorrenthalpy: 0.340903 hartree
zpe.thermalcorrgfe: 0.269089 hartree
zpe.sumelectzpe: -1049.357034 hartree
zpe.sumelectthermal: -1049.336270 hartree
zpe.sumelectthermalent: -1049.335325 hartree
zpe.sumelectthermalfe: -1049.407139 hartree
dipole: -4.1694 -1.7717 -0.6448
dipole: 4.5759
quadrupole: -156.2653 -133.7289 -122.5916
quadrupole: 18.5426 -8.1542 -5.7619
quadrupole: -18.7367 3.7997 14.9370 18.5426 -8.1542 -5.7619
hfenergy: -1049.6762283 hartree
pointgroup: C01 [X(C14H19N1O6)]
dipole: 1.6948021 -0.5411421 0.275443 debye
polarizability: 289.7232261|0.2289567|175.7851495|3.4208911|12.7790605|113.7238152 unknown
InChI: InChI=1S/C14H19NO6/c1-7(17)8-2-4-9(5-3-8)15-14-13(20)12(19)11(18)10(6-16)21-14/h2-5,10-16,18-20H,6H2,1H3
charge 0 multiplicity 1
40 atoms
O  1.4805 0.519632 -0.649289
O  4.868191 -1.3743 0.95112
O  4.846742 1.549587 0.571525
O  2.72386 -2.101395 -0.779701
O  3.400444 3.721358 -0.405235
O  -6.377412 -0.840466 -0.134721
N  0.06711 -1.355629 -0.111354
C  3.63685 -0.575581 0.942918
C  3.817269 0.65529 0.029667
C  2.428216 -1.432171 0.508192
C  2.499128 1.44709 -0.096656
C  1.155988 -0.56967 0.357138
C  2.619566 2.659334 -1.036403
C  -1.281106 -0.969512 -0.0527
C  -1.675527 0.330145 0.373776
C  -2.287759 -1.912803 -0.41589
C  -3.039945 0.658527 0.459883
C  -3.642527 -1.568827 -0.335233
C  -4.049708 -0.278916 0.111862
C  -5.510732 0.029859 0.186439
C  -5.949329 1.415074 0.658535
H  3.506504 -0.232072 1.985643
H  4.120947 0.313516 -0.986193
H  2.272453 -2.257207 1.223177
H  2.186508 1.807549 0.908518
H  0.904627 -0.064621 1.313808
H  1.619175 3.07992 -1.227967
H  3.062305 2.341495 -2.005667
H  0.311349 -2.203053 -0.629377
H  4.822116 -1.980051 0.161585
H  5.646283 1.004057 0.791379
H  2.600627 -1.417628 -1.495426
H  4.232639 3.30641 -0.042602
H  -0.919371 1.089482 0.592757
H  -1.993579 -2.916594 -0.746595
H  -3.316484 1.666721 0.786553
H  -4.424168 -2.286552 -0.606015
H  -5.555911 2.205523 -0.007778
H  -5.578895 1.625638 1.679118
H  -7.048847 1.460142 0.658512
