program: Gaussian 09
title: 000281489
version: EM64L-G09RevD.01
frameworkgroup: C1[X(C10H14O4)]
method: RPBEPBE
basis: SDD
operation: Freq
keyword: #pfreq=noraman
keyword: PBEPBE/SDD
title: #p freq=noraman PBEPBE/SDD
converged: YES YES NO YES
title: Mulliken charges:
elementType: O O O O C C C C C C C C C C H H H H H H H H H H H H H H
charge: -0.416087 -0.416084 -0.232876 -0.232879 -0.051655 -0.051627 -0.496798 -0.496807 -0.561686 -0.561701 -0.206408 -0.206418 0.171018 0.171022 0.248754 0.248750 0.246558 0.207408 0.246577 0.207410 0.256114 0.253658 0.256117 0.253653 0.204051 0.204053 0.377941 0.377941
chargesum: 0.00000
title: Mulliken charges with hydrogens summed into heavy atoms:
elementType: O O O O C C C C C C C C C C
charge: -0.038146 -0.038143 -0.232876 -0.232879 0.197100 0.197123 -0.042832 -0.042820 -0.051914 -0.051931 -0.002356 -0.002365 0.171018 0.171022
polarizability: 1.42316687e+02 -8.53358772e-05 1.12930994e+02 5.03867373e+00 -4.93241675e-04 8.88021229e+01
1716.lowfreq: -2.6380 -0.0008 -0.0007 -0.0006 7.6513 13.3446 27.7274 28.7339 49.0988
frequency: 27.7227 28.6323 49.0983 77.8065 81.3452 122.8852 131.9210 157.4276 203.2423 301.7261 338.2294 343.5668 371.2355 382.7930 485.2657 488.0585 512.1619 521.4453 530.1345 585.4799 614.9228 651.9347 652.8146 668.1858 758.6341 795.0306 853.1085 866.3590 873.1383 876.8246 933.5506 944.2102 974.1224 999.3096 1028.3829 1040.0804 1062.1738 1070.4873 1088.0562 1095.0539 1130.6085 1160.5323 1177.3377 1183.4612 1204.0293 1244.7795 1250.1978 1263.8959 1282.8056 1301.2999 1305.7900 1330.9295 1335.8272 1348.6952 1359.8877 1372.1606 1377.8293 1434.4166 1442.3351 1461.8852 1463.4630 1664.1017 1665.0740 1685.4854 2938.2260 2938.6500 2975.7445 2987.4447 2989.2180 2992.9595 3024.2874 3025.9641 3050.7232 3051.7699 3097.2413 3129.4701 3507.0670 3507.0903
redmass: 9.7643 9.6732 3.8633 3.5239 4.2880 3.0186 3.2454 3.0097 7.7770 4.6875 2.1655 3.5790 4.3346 2.0745 3.6668 2.7053 2.6889 2.6790 2.3297 4.2702 3.2822 1.4747 1.4395 1.1908 3.5625 2.8619 2.1245 5.3984 1.7308 3.3795 1.7609 2.6788 1.2142 2.2581 2.4997 2.4435 2.5966 2.3885 2.2666 2.3354 2.0426 1.2469 1.1897 1.2637 1.1457 1.4648 1.3944 1.3793 1.4723 1.2693 1.2158 1.4476 1.6920 1.8005 1.6505 1.7582 1.6377 1.0927 1.0884 1.1031 1.0740 8.2199 8.2442 6.4079 1.0680 1.0680 1.0816 1.0619 1.0597 1.0836 1.0911 1.0920 1.0974 1.0968 1.0838 1.0998 1.0639 1.0639
irintensity: 1.4884 0.9961 1.0379 0.1612 0.3127 0.0723 0.2385 5.5240 0.7521 2.0185 0.4692 3.5897 3.0613 0.4242 1.2614 40.3814 3.4175 34.6729 59.0559 0.0467 32.5912 122.8740 138.1281 38.4906 2.7292 0.1635 5.2717 3.8236 14.9177 3.5689 30.0020 5.0129 0.2475 1.0957 158.3766 357.5620 16.5883 15.0261 0.0471 57.0452 12.8652 14.7239 2.5221 18.2035 0.0022 1.1213 0.2925 3.6601 31.8418 0.3461 20.8013 2.8318 2.3404 48.0570 55.1558 24.5830 3.4784 10.4431 37.9740 0.5350 17.2640 280.0290 109.2379 9.0946 0.4844 58.9098 0.0704 0.2533 28.6600 27.6234 1.3527 27.9119 3.0915 29.3356 6.9370 64.6902 37.1089 8.4113
temp: 298.150 k
press: 1.00000 atm
elementType: 8 8 8 8 6 6 6 6 6 6 6 6 6 6 1 1 1 1 1 1 1 1 1 1 1 1 1 1
symmnumber: 1
zpe: 593642.3 jmol-1
zpe.correction: 0.226106 hartree
zpe.thermalcorrener: 0.240288 hartree
zpe.thermalcorrenthalpy: 0.241233 hartree
zpe.thermalcorrgfe: 0.182756 hartree
zpe.sumelectzpe: -689.284323 hartree
zpe.sumelectthermal: -689.270141 hartree
zpe.sumelectthermalent: -689.269197 hartree
zpe.sumelectthermalfe: -689.327674 hartree
dipole: -0.0001 -1.5030 -0.0003
dipole: 1.5030
quadrupole: -77.1811 -79.8906 -89.9616
quadrupole: -0.0012 9.6276 0.0003
quadrupole: 5.1633 2.4538 -7.6172 -0.0012 9.6276 0.0003
hfenergy: -689.5104295 hartree
pointgroup: C01 [X(C10H14O4)]
dipole: 0.0000219 -0.5913168 -0.0000716 debye
polarizability: 142.2135116|0.0027222|112.9309944|5.5586856|-0.0019406|88.9052987 unknown
InChI: InChI=1S/C10H14O4/c11-9(12)5-7-3-1-2-4-8(7)6-10(13)14/h1-2,7-8,11,13H,3-6H2
charge 0 multiplicity 1
28 atoms
O  -3.651428 -1.981185 -0.73067
O  3.651536 -1.980762 0.730973
O  -3.498758 -0.488753 1.038352
O  3.498941 -0.488245 -1.037987
C  -0.762181 0.259702 0.169264
C  0.762134 0.259724 -0.169366
C  -1.436117 1.51731 -0.446148
C  1.436033 1.517386 0.445967
C  -1.482569 -1.022049 -0.312345
C  1.482599 -1.021952 0.312304
C  -0.644768 2.788204 -0.211785
C  0.644657 2.78824 0.211494
C  -2.943799 -1.088679 0.091807
C  2.943918 -1.088303 -0.091564
H  -0.871892 0.323614 1.27177
H  0.871848 0.32358 -1.271875
H  -2.449818 1.630761 -0.016819
H  -1.579341 1.363987 -1.539075
H  2.449742 1.630826 0.016646
H  1.579244 1.364148 1.538907
H  -1.414625 -1.13418 -1.410657
H  -1.016934 -1.929446 0.121782
H  1.414466 -1.134161 1.410596
H  1.017181 -1.929389 -0.121972
H  -1.162039 3.740697 -0.390782
H  1.1619 3.740762 0.390421
H  -4.595003 -2.03636 -0.415597
H  4.595174 -2.035776 0.416059
