program: Gaussian 09
title: 000281495
version: EM64L-G09RevD.01
frameworkgroup: C1[X(C15H17NO2)]
method: RPBEPBE
basis: SDD
operation: Freq
keyword: #p
keyword: freq=noraman
keyword: PBEPBE/SDD
title: #p freq=noraman PBEPBE/SDD
converged: YES YES NO NO
title: Mulliken charges:
elementType: O O N C C C C C C C C C C C C C C C H H H H H H H H H H H H H H H H H
charge: -0.234442 -0.203639 -0.076199 0.160689 -0.507627 0.218592 -0.716420 -0.705720 -0.504636 0.192866 0.242080 -0.754874 0.282775 -0.363761 -0.346135 -0.241030 -0.231666 -0.233665 0.243379 0.216439 0.225083 0.238148 0.218944 0.211347 0.225527 0.233444 0.258286 0.253548 0.228965 0.271884 0.227160 0.270085 0.231952 0.233886 0.234734
chargesum: 0.00000
title: Mulliken charges with hydrogens summed into heavy atoms:
elementType: O O N C C C C C C C C C C C C C C C
charge: -0.234442 -0.203639 -0.076199 0.160689 -0.047809 0.218592 -0.034245 -0.035401 -0.246350 0.192866 0.242080 -0.000477 0.282775 -0.136601 -0.076050 -0.009078 0.002219 0.001070
polarizability: 2.71641961e+02 1.69969171e+01 1.19054056e+02 -6.23601748e+00 1.06869871e+01 1.51046298e+02
1716.lowfreq: -5.7238 -0.0004 0.0004 0.0007 4.6673 9.9215 23.4692 30.1800 39.1064
frequency: 22.4565 30.1286 39.0604 63.7660 79.0064 86.6615 124.6635 146.5063 185.8465 194.5119 221.0383 237.8704 254.9907 268.5229 281.6097 341.7083 372.5468 389.8187 399.5667 403.8261 444.5479 474.0387 488.0493 514.2966 563.5428 599.0668 614.1631 650.7815 680.1463 693.3056 711.5426 775.2038 779.1602 816.7376 832.6262 836.0378 854.6739 896.3579 916.8303 926.3307 932.4614 942.0328 966.1012 983.5620 988.5761 995.9035 1002.6827 1003.2622 1010.8687 1027.8564 1032.0286 1081.3871 1115.0711 1157.4715 1160.8431 1176.1620 1185.2854 1193.6538 1234.4258 1243.1830 1271.6957 1301.1871 1325.6970 1374.4396 1376.4770 1382.7400 1389.7709 1401.9165 1414.4152 1440.0717 1441.3088 1445.8058 1455.5325 1462.9476 1464.9318 1476.7148 1479.3740 1491.1455 1573.2535 1590.1736 1618.3271 1623.8718 2979.0364 2979.6412 2987.3663 2995.5668 3064.6669 3067.1897 3077.8991 3084.4146 3094.4997 3098.8591 3117.7199 3130.0885 3138.1022 3150.1576 3162.3108 3173.4678 3233.5776
redmass: 4.1630 5.3965 4.5489 4.1847 3.6572 4.4789 3.6790 1.5248 2.0679 3.4128 1.0519 2.8563 2.4738 1.4182 3.0367 3.9130 3.3598 3.4060 2.7987 3.1416 3.0279 3.9214 4.1192 3.4171 3.3930 3.0835 6.3783 4.9523 6.0014 1.7854 3.2178 1.7215 3.2437 4.7708 3.3042 1.7397 1.2614 1.9029 8.2863 2.2168 1.4292 1.5077 4.4028 1.3847 6.1548 1.3975 3.6745 1.3380 1.6580 1.5570 1.9166 1.5957 1.6973 1.6201 2.6511 1.0588 2.7405 1.1182 2.8539 4.2990 1.9385 1.4222 1.3762 2.0560 2.0612 1.2453 6.4236 1.5368 2.3014 1.3535 1.6306 1.0996 1.0562 1.0563 1.0560 1.8588 1.1320 1.1837 6.3436 6.7875 6.1315 7.4395 1.0388 1.0351 1.0583 1.0364 1.0966 1.0991 1.0998 1.1006 1.1003 1.0994 1.1008 1.0853 1.0883 1.0934 1.0965 1.1006 1.0984
irintensity: 0.2982 0.2407 3.8403 7.6688 0.1758 0.6663 0.3463 0.7521 1.2123 2.7412 0.1025 1.7556 0.2284 0.3374 0.6791 0.0868 0.9403 1.6810 0.0060 2.3073 1.2458 3.2476 7.4557 4.5307 2.6358 1.5815 0.0221 9.0930 9.4904 35.5032 6.4072 75.4670 1.1575 3.9599 5.7274 22.4088 1.0475 1.8002 4.3281 4.2389 3.6719 0.9174 15.4615 0.1350 0.5139 0.7642 4.3357 0.2383 1.6302 1.6084 8.6558 10.5441 4.9994 9.7848 0.8141 0.0965 32.3955 3.8496 58.6278 15.5037 64.1301 14.8350 1.3107 14.8732 27.1874 20.8927 31.5652 9.7868 2.6508 10.6500 9.2324 55.3625 17.7509 5.0624 10.6592 26.7578 20.5434 46.3046 54.8851 17.1147 3.5655 152.8333 0.0699 23.6044 21.3247 13.8010 3.4551 17.5592 42.1156 15.7598 42.0649 26.7305 16.6454 2.7981 2.1786 24.6573 19.8800 14.8789 0.9325
temp: 298.150 k
press: 1.00000 atm
elementType: 8 8 7 6 6 6 6 6 6 6 6 6 6 6 6 6 6 6 1 1 1 1 1 1 1 1 1 1 1 1 1 1 1 1 1
symmnumber: 1
zpe: 741569.4 jmol-1
zpe.correction: 0.282449 hartree
zpe.thermalcorrener: 0.300077 hartree
zpe.thermalcorrenthalpy: 0.301021 hartree
zpe.thermalcorrgfe: 0.235267 hartree
zpe.sumelectzpe: -785.638164 hartree
zpe.sumelectthermal: -785.620536 hartree
zpe.sumelectthermalent: -785.619592 hartree
zpe.sumelectthermalfe: -785.685346 hartree
dipole: 4.2620 -1.7537 -3.1150
dipole: 5.5627
quadrupole: -111.7616 -109.4722 -104.5241
quadrupole: 13.3055 -0.7631 3.5001
quadrupole: -3.1756 -0.8862 4.0618 13.3055 -0.7631 3.5001
hfenergy: -785.920613 hartree
pointgroup: C01[X(C15H17N1O2)]
dipole: 1.6487768 -0.0100216 1.4391391 debye
polarizability: 269.7391443|-24.7927282|118.8792513|0.0521192|-6.8707966|153.12392 unknown
InChI: InChI=1S/C15H17NO2/c1-11(17)10-15(2,3)14-9-13(18-16-14)12-7-5-4-6-8-12/h4-9H,10H2,1-3H3
charge 0 multiplicity 1
35 atoms
O  0.445461 0.633054 -1.251845
O  -4.993546 -1.690141 -0.387448
N  -0.991714 0.943678 -1.188252
C  -2.783013 0.873701 0.561622
C  -3.407414 -0.502966 1.013849
C  -1.345404 0.671856 0.093047
C  -3.65751 1.518562 -0.54338
C  -2.758718 1.809754 1.807244
C  -0.227587 0.202693 0.871282
C  -3.780466 -1.465334 -0.123175
C  0.86608 0.191023 0.013899
C  -2.662158 -2.130095 -0.913993
C  2.278315 -0.166965 0.164746
C  2.774209 -0.625875 1.416634
C  3.170889 -0.060293 -0.938077
C  4.133008 -0.969831 1.561267
C  4.52909 -0.406156 -0.787279
C  5.016506 -0.861894 0.460499
H  -4.338913 -0.281858 1.565644
H  -2.703001 -1.006174 1.705435
H  -3.284575 2.526019 -0.796577
H  -3.656892 0.923449 -1.471939
H  -4.70067 1.602337 -0.189733
H  -2.198951 1.362797 2.649243
H  -3.791326 2.005541 2.148695
H  -2.288362 2.777252 1.556243
H  -0.239041 -0.073864 1.92253
H  -3.067572 -2.970019 -1.499811
H  -1.847973 -2.480283 -0.254232
H  -2.212574 -1.397074 -1.612126
H  2.09868 -0.71279 2.274966
H  2.790521 0.293186 -1.901379
H  4.504074 -1.321544 2.529985
H  5.208147 -0.320474 -1.642389
H  6.072395 -1.130069 0.574903
