program: Gaussian 09
title: 000281484
version: EM64L-G09RevD.01
frameworkgroup: C1[X(C13H16O4)]
method: RPBEPBE
basis: SDD
operation: Freq
keyword: #pfreq=noraman
keyword: PBEPBE/SDD
title: #p freq=noraman PBEPBE/SDD
converged: YES YES NO NO
title: Mulliken charges:
elementType: O O O O C C C C C C C C C C C C C H H H H H H H H H H H H H H H H
charge: -0.417266 -0.418673 -0.231639 -0.229380 0.395163 -0.361719 -0.334690 -0.244878 -0.223941 -0.511021 -0.524863 -0.219460 -0.253276 -0.445057 -0.450030 0.130497 0.131678 0.297532 0.281216 0.315610 0.305022 0.204249 0.239222 0.224578 0.227525 0.244810 0.242651 0.209898 0.223781 0.220569 0.211596 0.380485 0.379810
chargesum: 0.00000
title: Mulliken charges with hydrogens summed into heavy atoms:
elementType: O O O O C C C C C C C C C C C C C
charge: -0.036781 -0.038863 -0.231639 -0.229380 0.395163 -0.064187 -0.053474 0.070732 0.081081 -0.067550 -0.072760 0.025350 -0.010625 -0.011378 -0.017864 0.130497 0.131678
polarizability: 1.45328328e+02 -3.53264913e+00 1.39182885e+02 -9.37567318e-01 1.71936621e+00 1.30393432e+02
1716.lowfreq: -9.0802 -0.0003 0.0005 0.0006 12.3427 14.5219 34.6487 46.1965 55.1983
frequency: 34.6311 46.1362 55.1200 72.5685 95.3757 109.2086 144.9222 161.9555 195.4897 240.5174 299.6111 314.7594 350.2713 380.6803 409.3671 433.8706 484.7425 500.6623 555.4459 574.6500 595.0744 617.4003 631.2934 649.9019 653.1053 675.7870 714.8238 743.1981 790.2955 807.4001 813.8183 831.9695 873.0400 879.0526 893.0938 919.5587 925.5957 938.7561 954.2198 962.4055 977.1650 982.9326 999.7263 1026.0103 1032.9691 1039.9058 1069.9446 1074.7349 1084.5713 1098.6288 1137.8925 1146.9864 1159.1558 1182.2351 1196.8119 1206.0269 1212.4057 1226.8219 1231.4678 1249.5839 1257.0924 1276.0726 1279.7422 1282.2963 1296.5784 1301.5469 1308.3624 1316.9282 1328.4141 1365.7812 1466.8251 1475.7352 1480.8963 1496.4150 1584.8440 1651.9693 1660.7195 2985.9323 2987.8389 2992.2684 2995.0879 3011.0012 3042.8099 3054.9914 3059.6541 3072.3419 3086.0109 3092.3724 3097.7277 3158.9901 3190.9291 3506.6693 3514.3273
redmass: 9.8024 8.6803 1.8270 5.6780 5.3826 5.5009 3.4176 2.9763 4.7290 3.5389 6.0465 3.2441 6.8110 2.5390 4.3657 3.3893 3.0253 3.1223 2.7907 2.5064 2.3953 2.5675 2.2372 2.0012 2.0366 2.3340 2.7600 2.1859 2.1640 2.7861 1.5977 3.4954 2.8627 4.3906 2.9113 2.2282 1.5107 3.6948 2.5785 2.3860 2.2427 2.1698 2.1881 2.4768 1.5860 3.0487 1.7292 2.0816 1.6227 1.5609 1.3007 2.6891 1.5953 1.3483 1.4527 1.4277 1.3880 1.2657 1.4067 1.4380 1.4602 1.6049 1.3301 1.6380 1.4906 1.5047 1.8511 1.5951 1.7851 1.8767 1.0794 1.0834 1.0838 1.0995 5.9041 9.1577 8.6575 1.0660 1.0817 1.0619 1.0625 1.0656 1.0990 1.0984 1.0859 1.1013 1.0982 1.0891 1.0913 1.0874 1.1095 1.0639 1.0640
irintensity: 1.5574 0.8321 0.0587 0.5106 0.6266 0.2646 0.9174 0.3870 0.6822 1.3791 5.2189 2.4282 2.2250 1.3110 10.7279 1.0865 0.3942 3.0727 50.8464 73.5098 65.6870 14.2748 23.8151 28.5653 63.5717 83.8056 24.9514 20.3545 3.8442 17.1731 3.4461 6.0356 10.7703 9.2607 2.5624 17.1574 2.2286 17.8930 7.0065 8.1801 33.2578 14.1982 12.6058 25.0923 20.3015 51.4378 130.5508 211.0065 3.4659 22.0253 13.4629 9.9700 18.8312 3.4601 3.9127 2.3523 3.1963 0.2169 5.1609 2.7402 5.2080 14.2794 1.5730 9.7576 9.1382 2.5518 16.8335 12.0505 10.0809 48.8346 4.6380 9.5774 9.0096 5.2428 2.3195 229.9569 200.8781 18.8133 10.8127 27.4515 41.4213 55.6143 19.9535 2.2914 5.8722 55.9734 35.1844 33.9295 3.8513 4.2825 17.0788 21.1162 26.5448
temp: 298.150 k
press: 1.00000 atm
elementType: 8 8 8 8 6 6 6 6 6 6 6 6 6 6 6 6 6 1 1 1 1 1 1 1 1 1 1 1 1 1 1 1 1
symmnumber: 1
zpe: 701878.5 jmol-1
zpe.correction: 0.267331 hartree
zpe.thermalcorrener: 0.282595 hartree
zpe.thermalcorrenthalpy: 0.283539 hartree
zpe.thermalcorrgfe: 0.223901 hartree
zpe.sumelectzpe: -804.582942 hartree
zpe.sumelectthermal: -804.567679 hartree
zpe.sumelectthermalent: -804.566735 hartree
zpe.sumelectthermalfe: -804.626373 hartree
dipole: -1.0010 -1.2156 -1.7151
dipole: 2.3284
quadrupole: -101.5121 -97.2582 -98.2541
quadrupole: 0.0937 -4.7365 -4.0497
quadrupole: -2.5040 1.7499 0.7541 0.0937 -4.7365 -4.0497
hfenergy: -804.8502738 hartree
pointgroup: C01 [X(C13H16O4)]
dipole: 0.4018743 0.4542546 -0.6865042 debye
polarizability: 145.189456|-3.6335788|139.2386436|0.9593162|-1.9393247|130.476545 unknown
InChI: InChI=1S/C13H16O4/c14-11(15)9-7-3-4-8(10(9)12(16)17)13(7)5-1-2-6-13/h3-4,7-10,14,16H,1-2,5-6H2
charge 0 multiplicity 1
33 atoms
O  -1.796659 -2.350438 -0.947738
O  -2.282997 1.96082 -1.708982
O  -0.504855 -3.142373 0.80613
O  -3.182222 1.159203 0.273365
C  1.321119 0.088815 0.247469
C  0.379515 -0.367975 1.420498
C  0.31297 1.221357 -0.207442
C  -0.953363 -0.716562 0.63796
C  -0.977954 0.336852 -0.517381
C  2.727015 0.606617 0.661428
C  1.698326 -0.967163 -0.827561
C  0.087394 0.971871 2.102828
C  0.043873 1.924571 1.12739
C  3.533609 0.701365 -0.665336
C  2.855927 -0.320213 -1.641575
C  -1.018511 -2.170471 0.209629
C  -2.252502 1.149539 -0.562855
H  0.735705 -1.19173 2.055567
H  0.603083 1.859006 -1.055366
H  -1.834652 -0.553294 1.291034
H  -0.860281 -0.133744 -1.507392
H  3.188982 -0.143638 1.33358
H  2.689376 1.560046 1.211932
H  0.865273 -1.281994 -1.479981
H  2.056737 -1.87744 -0.308312
H  -0.139609 1.094064 3.164935
H  -0.219575 2.979624 1.236951
H  4.602897 0.476109 -0.505419
H  3.480023 1.725333 -1.078482
H  2.458698 0.20054 -2.532491
H  3.56588 -1.083241 -2.007097
H  -1.860797 -3.324737 -1.144971
H  -3.127627 2.487982 -1.710215
