program: Gaussian 09
title: 000281461
version: EM64L-G09RevD.01
frameworkgroup: C1[X(C12H16O2)]
method: RPBEPBE
basis: SDD
operation: Freq
keyword: #pfreq=noraman
keyword: PBEPBE/SDD
title: #p freq=noraman PBEPBE/SDD
converged: YES YES NO NO
title: Mulliken charges:
elementType: O O C C C C C C C C C C C C H H H H H H H H H H H H H H H H
charge: -0.283398 -0.264800 0.172365 0.198702 -0.126793 -0.565915 -0.502464 -0.526823 0.305593 -0.216015 -0.417661 -0.213402 -0.511378 -0.536898 0.177227 0.220853 0.272981 0.206535 0.211695 0.221997 0.215453 0.215709 0.226536 0.211542 0.234238 0.205231 0.195090 0.238811 0.216538 0.218451
chargesum: 0.00000
title: Mulliken charges with hydrogens summed into heavy atoms:
elementType: O O C C C C C C C C C C C C
charge: -0.283398 -0.264800 0.172365 0.198702 0.050434 -0.072081 -0.084233 -0.089373 0.305593 -0.000306 -0.191125 -0.001859 0.123180 0.136902
polarizability: 1.46665684e+02 -2.19311909e+00 1.61264403e+02 -2.32204070e+00 7.82796448e+00 8.28716008e+01
1716.lowfreq: -7.3401 -0.0007 -0.0003 0.0007 4.7370 11.3525 39.2250 43.7219 69.4240
frequency: 38.7004 43.7040 69.3960 113.1254 136.0248 158.7663 193.6501 199.4964 217.9627 256.1891 278.9890 294.1685 328.6106 338.2214 388.5540 451.6860 473.0478 498.6164 509.5962 522.2657 593.6541 656.6821 690.1927 745.7761 782.8371 804.5022 851.3095 877.6694 898.8383 941.4816 962.2755 972.9946 978.9020 987.1577 1005.4384 1011.8350 1044.8980 1104.7002 1114.9793 1116.9796 1126.6167 1141.3295 1157.4691 1160.2381 1164.1403 1175.6027 1184.2762 1196.1241 1209.5058 1290.5328 1298.6148 1327.9429 1348.2678 1368.3046 1388.4612 1396.9616 1427.1067 1433.3939 1438.0166 1454.4740 1456.6322 1460.4810 1460.6380 1475.6632 1478.0055 1676.6579 1689.2057 1724.4462 2872.1015 2912.5579 2922.5503 2928.9759 2934.6388 2948.1461 2953.1496 2954.6042 2999.5197 3005.7195 3037.5465 3092.8715 3099.9418 3119.2578 3132.0613 3140.3023
redmass: 3.1402 2.9831 2.4297 2.6039 3.1351 2.3870 1.7772 1.7380 1.5710 3.0844 1.8024 3.3545 2.6681 4.1633 3.7885 4.2536 2.4057 3.1785 3.9266 4.3677 4.8129 4.5810 1.6720 4.0408 1.3173 4.9921 2.9710 4.3683 1.8401 3.4816 1.7391 2.4290 2.3144 1.6276 3.8930 4.1793 2.1337 1.2773 1.2723 1.8805 2.9231 1.3550 1.2555 1.5860 1.5306 1.0967 1.2249 2.0860 1.1376 1.2383 1.5539 1.7787 1.9996 1.8471 1.7554 3.3992 1.1265 1.1948 1.0843 1.1081 1.0705 1.0521 1.0742 1.0517 1.0505 6.9427 6.9398 7.6976 1.0808 1.0590 1.0349 1.0598 1.0972 1.0662 1.0331 1.0957 1.1010 1.0895 1.1033 1.0968 1.0842 1.0993 1.0992 1.0901
irintensity: 1.2826 1.1942 4.2326 1.3077 6.7620 2.9312 6.1201 0.1074 3.7565 8.8844 0.0822 1.3104 3.8472 2.4067 2.5288 1.4666 1.2381 13.1188 2.2161 0.6570 2.7652 11.0801 15.6264 2.9672 52.1586 1.9661 58.9686 6.9772 5.5386 11.9247 6.9100 6.6528 11.5038 0.4677 83.7936 71.4321 3.9881 1.8992 0.5677 26.7402 28.2048 15.4023 3.3482 5.1882 23.4428 0.9558 20.8726 76.6372 1.1000 16.2554 10.5772 7.9162 1.4079 29.4598 26.7742 8.5166 2.9856 9.0004 7.7812 0.2447 6.1864 12.8853 17.6263 18.2533 11.4493 3.3999 50.0206 11.0190 63.7703 49.4426 111.7092 61.9557 23.1476 33.3765 59.4483 26.4611 70.8311 5.7927 54.0407 31.3295 8.9742 27.8706 59.0084 24.4928
temp: 298.150 k
press: 1.00000 atm
elementType: 8 8 6 6 6 6 6 6 6 6 6 6 6 6 1 1 1 1 1 1 1 1 1 1 1 1 1 1 1 1
symmnumber: 1
zpe: 656851.1 jmol-1
zpe.correction: 0.250181 hartree
zpe.thermalcorrener: 0.264303 hartree
zpe.thermalcorrenthalpy: 0.265247 hartree
zpe.thermalcorrgfe: 0.208827 hartree
zpe.sumelectzpe: -616.183524 hartree
zpe.sumelectthermal: -616.169402 hartree
zpe.sumelectthermalent: -616.168458 hartree
zpe.sumelectthermalfe: -616.224878 hartree
dipole: -0.0896 1.2791 -0.9031
dipole: 1.5684
quadrupole: -67.5573 -76.7322 -87.1494
quadrupole: -4.1712 -3.4068 2.7319
quadrupole: 9.5890 0.4141 -10.0031 -4.1712 -3.4068 2.7319
hfenergy: -616.4337052 hartree
pointgroup: C01 [X(C12H16O2)]
dipole: -0.009464 0.4946608 -0.3687512 debye
polarizability: 146.660658|-2.8070095|161.5548206|2.7504648|5.7883851|82.5862094 unknown
InChI: InChI=1S/C12H16O2/c1-13-10-7-6-9-4-3-5-12(14-2)11(9)8-10/h3,5,7,12H,4,6,8H2,1-2H3
charge 0 multiplicity 1
30 atoms
O  1.92647 -1.686518 0.698996
O  -3.052617 -1.349806 -0.52603
C  0.461448 -0.039159 -0.294985
C  0.278031 1.293665 -0.081603
C  1.837554 -0.667942 -0.404949
C  -0.687809 -1.022317 -0.426608
C  -1.102921 1.920119 0.029045
C  1.435945 2.26517 0.055076
C  -2.048332 -0.376341 -0.352981
C  2.980558 0.315052 -0.320593
C  -2.25426 0.952277 -0.146451
C  2.800843 1.639735 -0.093065
C  2.95374 -2.700914 0.465844
C  -4.43969 -0.889414 -0.46512
H  1.903068 -1.246051 -1.3602
H  -0.605515 -1.579865 -1.384932
H  -0.59665 -1.793687 0.363561
H  -1.185414 2.744114 -0.716048
H  -1.18509 2.428977 1.016744
H  1.371968 2.776427 1.041994
H  1.319857 3.085291 -0.688646
H  3.994537 -0.090731 -0.43137
H  -3.26579 1.370584 -0.095152
H  3.669763 2.307629 -0.017224
H  2.812329 -3.461678 1.250591
H  3.981011 -2.288885 0.547017
H  2.836319 -3.176426 -0.532726
H  -5.054541 -1.78892 -0.617978
H  -4.650577 -0.147999 -1.261379
H  -4.667234 -0.439191 0.521471
