program: Gaussian 09
title: 000281463
version: EM64L-G09RevD.01
frameworkgroup: C1[X(C15H14O4)]
method: RPBEPBE
basis: SDD
operation: Freq
keyword: #pfreq=noraman
keyword: PBEPBE/SDD
title: #p freq=noraman PBEPBE/SDD
converged: YES YES NO NO
title: Mulliken charges:
elementType: O O O O C C C C C C C C C C C C C C C H H H H H H H H H H H H H H
charge: -0.273623 -0.242347 -0.427529 -0.239765 -0.296537 -0.228303 -0.223739 -0.229333 -0.021250 -0.465841 -0.473354 0.170837 0.163876 0.191331 -0.365764 -0.324610 -0.218876 0.098337 -0.219067 0.263222 0.255461 0.251973 0.279484 0.253350 0.216967 0.214921 0.204109 0.279629 0.273553 0.270287 0.240220 0.239337 0.383046
chargesum: 0.00000
title: Mulliken charges with hydrogens summed into heavy atoms:
elementType: O O O O C C C C C C C C C C C C C C C
charge: -0.273623 -0.242347 -0.044483 -0.239765 -0.033315 0.027158 0.028234 0.050151 0.232099 -0.033954 0.010384 0.170837 0.163876 0.191331 -0.092211 -0.054324 0.021344 0.098337 0.020270
polarizability: 2.21725832e+02 8.11786272e+00 1.68655415e+02 -1.52288730e+01 3.56302129e+00 1.07606009e+02
1716.lowfreq: -13.5573 -6.4700 -3.4300 -0.0005 -0.0004 0.0004 10.8180 40.2319 52.5800
frequency: 8.1899 40.2277 52.5773 85.0268 99.1604 116.5410 136.4595 157.0330 215.8336 239.3314 280.0540 313.7044 354.1947 378.8398 406.7755 413.7084 442.1485 480.9134 534.8401 576.9313 589.9984 600.3470 640.9595 649.8085 674.2822 683.8339 708.3950 748.1936 782.2267 786.4629 789.6712 793.6093 800.4486 827.8412 875.0560 900.1589 903.9696 907.8910 911.6743 921.9310 933.8783 976.9108 979.1123 986.6943 999.9655 1005.5774 1014.7464 1027.5314 1034.7927 1046.6018 1058.6764 1067.9685 1072.4404 1110.9517 1125.2317 1130.1574 1163.1912 1178.4750 1186.0093 1228.7630 1234.9047 1243.7312 1256.8702 1265.0904 1277.3988 1286.0064 1308.0762 1313.1088 1341.3297 1353.1608 1381.7723 1427.7461 1468.4314 1477.7919 1482.3577 1576.7572 1600.4571 1610.0059 1648.2714 3005.1089 3016.9939 3042.1063 3067.4184 3097.1231 3130.9177 3139.8381 3155.3694 3169.1518 3171.8801 3178.7954 3180.3108 3199.5144 3521.5443
redmass: 4.5731 6.4886 5.1646 6.2692 7.0094 4.4022 6.3273 5.9683 6.1082 5.2842 7.2111 4.6348 9.0179 6.7828 3.3867 1.9106 2.1031 4.0471 4.7085 5.0338 1.4051 4.1188 4.5934 6.0507 4.9884 4.7531 3.6666 5.6364 3.6343 3.5522 1.6472 1.8489 1.9966 5.3557 2.4765 2.5849 1.7208 1.8075 2.3129 2.3186 1.9242 1.5515 1.4255 2.7178 4.8955 1.3782 1.3854 1.9868 2.9871 1.3981 1.2119 1.5058 3.1208 1.8486 1.2468 1.2915 1.7621 1.0620 2.0429 1.9867 2.0732 1.8130 1.4221 2.0445 1.5842 1.6148 1.7273 2.5304 1.7570 1.8124 10.7566 2.1923 1.0918 2.6285 1.1019 7.5959 6.7661 9.7064 9.0171 1.0595 1.0631 1.0864 1.1051 1.1022 1.0918 1.0864 1.0911 1.0958 1.0920 1.0928 1.0985 1.1009 1.0641
irintensity: 0.1151 0.9765 2.4321 0.7306 1.6674 1.1095 0.2848 1.7535 0.7057 2.6692 6.7422 2.5993 1.4911 10.8806 3.7772 1.9524 2.1822 2.7298 16.2721 11.1496 83.6670 34.0454 0.7746 10.7956 5.0259 3.5715 95.7909 2.0064 19.5352 2.0569 42.4293 14.3200 29.4450 1.7108 6.8970 18.8829 4.9648 13.2419 8.9879 2.4117 15.1063 23.8356 12.6006 22.2749 196.6870 5.0015 4.5238 43.9462 81.7969 4.4144 5.2071 26.4693 164.8594 53.4455 2.8122 4.1764 67.6150 0.2310 3.4294 46.9472 116.2296 85.6185 3.1452 9.6760 57.9329 18.1216 6.6483 68.1660 1.6491 12.5380 12.5256 7.8439 9.0612 16.2060 11.6645 50.7777 61.5577 76.1653 252.5570 49.0017 47.3088 13.2402 32.8949 8.8143 12.3746 2.6590 8.7617 8.5659 7.8884 11.6671 13.1456 20.8746 35.1905
temp: 298.150 k
press: 1.00000 atm
elementType: 8 8 8 8 6 6 6 6 6 6 6 6 6 6 6 6 6 6 6 1 1 1 1 1 1 1 1 1 1 1 1 1 1
symmnumber: 1
zpe: 674611.7 jmol-1
zpe.correction: 0.256946 hartree
zpe.thermalcorrener: 0.272545 hartree
zpe.thermalcorrenthalpy: 0.273490 hartree
zpe.thermalcorrgfe: 0.211584 hartree
zpe.sumelectzpe: -879.505193 hartree
zpe.sumelectthermal: -879.489594 hartree
zpe.sumelectthermalent: -879.488650 hartree
zpe.sumelectthermalfe: -879.550555 hartree
dipole: -1.2168 1.4065 1.9385
dipole: 2.6864
quadrupole: -87.4637 -102.3208 -114.5305
quadrupole: 1.8544 -0.3628 -3.3425
quadrupole: 13.9746 -0.8824 -13.0922 1.8544 -0.3628 -3.3425
hfenergy: -879.7621392 hartree
pointgroup: C01 [X(C15H14O4)]
dipole: 0.4584646 -0.1878121 0.9335918 debye
polarizability: 219.2659262|17.4480432|158.3945812|15.4073014|-23.2219629|120.3267484 unknown
InChI: InChI=1S/C15H14O4/c16-14(17)8-3-1-2-4-9(8)15(18)19-13-7-5-10-11(6-7)12(10)13/h1-4,7,10-13,16H,5-6H2
charge 0 multiplicity 1
33 atoms
O  -0.573128 0.482973 0.282838
O  -0.019212 1.717312 -1.618389
O  1.778426 -2.482091 1.532749
O  0.572869 -2.08022 -0.407567
C  -2.825069 0.414526 1.285889
C  -4.258091 0.165181 0.745934
C  -3.314847 -1.029158 1.01692
C  -2.736067 -0.038953 -1.006319
C  -2.012391 0.833916 0.067716
C  -4.209086 0.429928 -0.77307
C  -2.732269 -1.45056 -0.344087
C  0.321447 1.003618 -0.642216
C  1.754161 0.743473 -0.263829
C  2.243984 -0.447752 0.348312
C  2.645864 1.822272 -0.484531
C  3.594399 -0.506758 0.778521
C  3.993107 1.746761 -0.072992
C  1.426955 -1.695452 0.422516
C  4.464959 0.584292 0.576856
H  -2.624036 0.803396 2.283933
H  -5.141411 0.36376 1.354708
H  -3.488498 -1.731006 1.833894
H  -2.342459 0.042428 -2.026923
H  -2.058707 1.911135 -0.173727
H  -4.365953 1.493133 -1.031911
H  -4.93397 -0.182233 -1.339116
H  -3.387973 -2.156431 -0.88606
H  -1.718314 -1.875449 -0.272569
H  2.25849 2.720613 -0.975097
H  3.953132 -1.423081 1.255086
H  4.665353 2.592778 -0.25025
H  5.505649 0.520783 0.911315
H  1.244486 -3.321634 1.507865
