program: Gaussian 09
title: 000281498
version: EM64L-G09RevD.01
frameworkgroup: C1[X(C18H21NO3)]
method: RPBEPBE
basis: SDD
operation: Freq
keyword: #p
keyword: freq=noraman
keyword: PBEPBE/SDD
title: #p freq=noraman PBEPBE/SDD
converged: YES YES NO NO
title: Mulliken charges:
elementType: O O O N C C C C C C C C C C C C C C C C C C H H H H H H H H H H H H H H H H H H H H H
charge: -0.285461 -0.277305 -0.296618 -0.205206 0.186980 -0.398871 -0.405607 -0.544714 -0.574143 0.202048 0.242610 0.432481 -0.514085 -0.598739 -0.237944 0.184913 0.190888 -0.376445 0.172610 -0.541815 -0.504323 -0.795477 0.229721 0.223064 0.229891 0.221566 0.237883 0.227571 0.230465 0.234535 0.261548 0.260584 0.243762 0.221418 0.256047 0.226963 0.239369 0.217741 0.256060 0.227103 0.246272 0.223294 0.229366
chargesum: 0.00000
title: Mulliken charges with hydrogens summed into heavy atoms:
elementType: O O O N C C C C C C C C C C C C C C C C C C
charge: -0.285461 -0.277305 -0.296618 -0.205206 0.186980 0.053914 0.045850 -0.079259 -0.109143 0.202048 0.242610 0.432481 -0.252537 -0.338155 0.005818 0.184913 0.190888 -0.155027 0.172610 0.180564 0.196581 -0.096546
polarizability: 3.65394603e+02 3.65243425e+01 3.06043697e+02 -3.85542960e+00 2.09931497e+00 1.20552314e+02
1716.lowfreq: -14.5902 -0.0004 -0.0004 0.0001 3.7534 5.6922 7.9008 34.4409 37.7441
frequency: -14.3627 34.3970 37.7298 43.0904 56.1716 69.6081 77.2043 101.0618 114.7636 121.2586 129.2491 146.8422 175.7365 196.2723 212.0271 218.5236 230.1039 238.5356 266.4029 284.6814 301.4005 329.0063 361.2907 382.0768 414.0797 419.2830 443.6861 463.9232 484.5185 525.0960 546.8313 564.1639 579.5778 609.3943 628.1291 649.4849 690.1377 705.8910 715.9799 741.3713 756.9216 814.8382 837.0394 861.1132 868.1470 887.6634 893.1053 907.2218 950.8488 956.5308 966.8636 979.1558 986.7830 1002.4352 1005.0602 1020.1432 1041.3914 1057.5689 1094.4848 1107.6076 1110.3026 1138.4065 1154.5530 1160.1574 1168.2780 1173.4279 1184.6030 1193.5146 1211.0532 1223.1370 1242.3132 1255.4536 1262.9352 1277.0136 1296.4897 1298.7571 1308.3279 1326.3821 1332.9147 1361.5912 1379.9244 1389.3168 1404.0750 1437.4965 1440.5121 1443.1801 1452.4436 1453.1216 1458.8593 1459.5500 1469.0107 1469.8183 1471.6568 1475.5806 1480.4435 1498.0647 1511.6594 1527.0788 1550.8854 1566.0285 1611.6092 1626.8271 2921.3217 2949.1963 2970.5147 2974.7386 2977.2146 2984.8037 2989.1748 3019.1143 3035.8016 3042.6091 3053.7754 3058.3850 3063.7689 3099.4033 3114.8049 3118.0507 3130.5348 3132.4290 3133.5805 3148.8528 3207.3348
redmass: 1.0520 4.3305 4.6496 2.6267 3.3518 2.8517 2.5345 2.3198 3.6871 3.0515 2.2717 3.3619 2.9323 3.2775 2.7468 3.4237 2.6310 3.7335 2.2603 2.0340 4.5477 3.0993 5.1837 3.2799 2.9032 3.7153 4.2138 3.3510 4.2801 3.8618 4.6166 4.2203 3.0251 5.4610 4.9896 3.3238 4.7346 5.1591 5.7596 3.3258 3.8327 1.3929 1.5341 2.1445 2.0260 2.4347 1.6304 3.8960 2.2940 3.4393 3.1059 1.3195 2.9719 2.8518 2.5396 1.7520 1.6911 1.9812 4.4029 1.2765 1.2502 1.7644 1.4047 1.3619 1.8835 1.6032 1.6301 1.6716 1.2129 1.9787 1.7496 1.4304 1.7814 1.9109 2.0102 2.0191 1.5559 1.6917 1.6548 1.2557 5.5873 3.4789 2.6596 1.2719 1.3880 1.1510 1.1552 1.0698 1.0514 1.7456 1.1205 1.0519 1.0531 1.0888 1.1535 2.5294 1.5392 5.3577 6.3375 8.1546 6.3253 6.6336 1.0695 1.0661 1.0326 1.0370 1.0642 1.0645 1.0325 1.0946 1.0920 1.1027 1.0973 1.0968 1.1048 1.0995 1.0974 1.0936 1.1007 1.1056 1.0859 1.0916 1.0892
irintensity: 1.1950 1.5916 0.8810 7.1053 1.8455 7.3076 3.6792 4.3073 1.5782 4.4084 1.5507 3.2441 6.0035 0.7787 1.5773 3.0940 1.7528 5.6009 4.2437 1.3060 3.1823 6.4782 9.3440 10.0621 0.5896 0.9200 0.3328 2.4014 1.7819 35.2488 14.2585 7.8327 1.7456 6.9119 6.7653 5.3984 12.1250 2.1945 9.4802 0.1569 17.5809 20.4889 6.5561 7.9742 14.5445 12.7229 24.5498 4.3563 93.3415 12.6956 36.3503 25.0474 34.4819 25.2355 4.0418 5.0716 1.2158 4.4079 29.7996 0.5998 5.7607 31.6232 31.4893 26.6118 50.0808 128.7947 11.7355 18.7162 6.1266 29.9729 71.8255 255.5359 42.8768 123.8009 165.0735 52.2672 140.6666 110.9866 19.7489 34.1222 34.3358 304.9984 79.6908 33.1316 70.8376 35.2793 20.0693 7.9386 17.2448 38.8476 9.2615 29.5162 29.3310 62.6829 18.2840 64.3911 74.3095 508.2402 51.2239 48.5729 351.9595 123.6714 96.4472 105.1672 30.0760 12.2693 23.5121 39.3485 85.7170 35.2040 56.4204 36.1624 37.8579 21.0858 29.9556 41.9194 15.4813 23.5465 23.0996 18.0117 6.4767 8.6544 2.4430
temp: 298.150 k
press: 1.00000 atm
elementType: 8 8 8 7 6 6 6 6 6 6 6 6 6 6 6 6 6 6 6 6 6 6 1 1 1 1 1 1 1 1 1 1 1 1 1 1 1 1 1 1 1 1 1
symmnumber: 1
zpe: 919246.8 jmol-1
zpe.correction: 0.350123 hartree
zpe.thermalcorrener: 0.371366 hartree
zpe.thermalcorrenthalpy: 0.372311 hartree
zpe.thermalcorrgfe: 0.298992 hartree
zpe.sumelectzpe: -977.276997 hartree
zpe.sumelectthermal: -977.255753 hartree
zpe.sumelectthermalent: -977.254809 hartree
zpe.sumelectthermalfe: -977.328127 hartree
dipole: 0.8891 4.9204 0.6446
dipole: 5.0414
quadrupole: -126.6976 -113.6520 -131.4169
quadrupole: -14.2369 -6.9054 -2.1767
quadrupole: -2.7754 10.2701 -7.4947 -14.2369 -6.9054 -2.1767
hfenergy: -977.6271193 hartree
pointgroup: C01 [X(C18H21N1O3)]
dipole: -0.2695988 1.9566153 -0.1817493 debye
polarizability: 362.5427163|-38.666659|308.8762967|-0.6840892|4.7414733|120.5716012 unknown
InChI: InChI=1S/C18H21NO3/c1-12(20)4-5-13-6-8-19-9-7-14-10-16(21-2)17(22-3)11-15(14)18(13)19/h4-5,10-11H,6-9H2,1-3H3
charge 0 multiplicity 1
43 atoms
O  -2.36431 -2.418731 -0.768688
O  -4.649647 -0.799686 0.003569
O  2.821551 -3.087448 0.377384
N  0.576092 2.973687 0.005289
C  0.552985 1.580248 -0.009857
C  1.946915 3.497625 -0.203989
C  -0.630818 3.788909 -0.161504
C  2.851212 2.238952 -0.038003
C  -1.779446 3.151256 0.64924
C  1.86541 1.063125 0.003172
C  -0.762025 0.91817 -0.035297
C  -1.925567 1.678972 0.292947
C  -0.918092 -0.444522 -0.405411
C  -3.181145 1.042322 0.299988
C  2.267289 -0.291614 0.150813
C  -2.174433 -1.07914 -0.393159
C  -3.334215 -0.328423 -0.00926
C  3.562496 -0.798663 0.141408
C  3.782763 -2.243489 0.284326
C  -1.165743 -3.204208 -1.107386
C  -4.937787 -2.19496 0.39873
C  5.235528 -2.72402 0.320563
H  2.175071 4.293798 0.528736
H  2.032912 3.93629 -1.220578
H  -0.916315 3.865339 -1.235267
H  -0.41721 4.810426 0.203243
H  3.438417 2.281626 0.899469
H  3.574456 2.145999 -0.868507
H  -2.721853 3.693333 0.453263
H  -1.55358 3.262893 1.729035
H  -0.052543 -1.000975 -0.762631
H  -4.089066 1.59689 0.559766
H  1.501019 -1.056762 0.323532
H  4.438023 -0.149891 0.011583
H  -0.4356 -3.216604 -0.276119
H  -0.680045 -2.812834 -2.021367
H  -1.539421 -4.221458 -1.293628
H  -4.438199 -2.440852 1.353938
H  -4.613517 -2.902635 -0.378674
H  -6.031036 -2.220462 0.526442
H  5.265861 -3.824833 0.312047
H  5.805405 -2.332333 -0.54323
H  5.737909 -2.357816 1.236873
