program: Gaussian 09
title: 000281451
version: EM64L-G09RevD.01
frameworkgroup: C1[X(C21H13NO4)]
method: RPBEPBE
basis: SDD
operation: Freq
keyword: #p
keyword: freq=noraman
keyword: PBEPBE/SDD
title: #p freq=noraman PBEPBE/SDD
converged: YES YES NO NO
title: Mulliken charges:
elementType: O O O O N C C C C C C C C C C C C C C C C C C C C C H H H H H H H H H H H H H
charge: -0.260626 -0.260054 -0.442142 -0.255278 -0.048448 0.412121 0.442290 0.391175 -0.583103 0.014075 0.183763 0.178809 -0.547519 -0.539649 -0.459598 -0.410403 0.280127 -0.368614 -0.113502 0.182067 -0.202432 -0.363293 -0.324277 -0.249511 -0.228958 0.112782 0.293554 0.268258 0.264840 0.239578 0.222727 0.269624 0.241005 0.241190 0.298606 0.265246 0.232372 0.234079 0.389118
chargesum: 0.00000
title: Mulliken charges with hydrogens summed into heavy atoms:
elementType: O O O O N C C C C C C C C C C C C C C C C C C C C C
charge: -0.260626 -0.260054 -0.053023 -0.255278 -0.048448 0.412121 0.442290 0.391175 -0.289549 0.014075 0.183763 0.178809 -0.279261 -0.274810 -0.220020 -0.187676 0.280127 -0.098990 -0.113502 0.182067 0.279762 -0.064687 -0.059031 -0.017139 0.005121 0.112782
polarizability: 5.37273046e+02 2.16055622e+01 2.84039030e+02 -4.71466243e-01 1.22752087e+00 9.64219309e+01
1716.lowfreq: -48.1712 -0.0010 -0.0005 0.0006 2.7930 3.7858 8.9890 13.4976 35.4899
frequency: -48.1606 13.1839 35.4830 42.6585 60.0463 85.9191 109.6559 131.4216 152.2825 180.6937 195.5111 204.0379 233.3006 270.1143 299.3791 318.6971 360.9807 365.1875 374.0041 399.4232 410.6833 422.4211 438.2970 481.4733 503.7376 518.8130 527.0565 557.9411 582.8319 593.9397 608.7361 613.3139 618.6441 644.6647 679.9993 686.1186 697.2189 714.2941 736.3999 738.0145 758.6320 779.5742 787.2130 794.6663 815.7648 818.5040 836.8232 839.9995 864.9955 865.7244 879.4233 894.3712 933.8242 944.0643 956.5840 961.5981 968.3297 977.4573 983.0293 1007.4645 1023.9518 1027.3979 1064.2234 1066.2728 1073.0185 1120.1342 1131.0605 1159.9021 1168.6510 1172.1084 1197.0966 1219.3041 1240.9734 1259.4538 1265.2986 1285.4147 1290.2899 1316.6805 1328.7131 1351.3693 1363.2092 1382.0861 1402.1425 1414.1382 1428.7265 1443.9388 1458.5552 1461.6894 1484.6103 1507.0028 1522.6275 1536.6354 1576.6771 1612.2983 1617.3671 1624.7295 1636.7309 1639.7595 3017.4171 3096.2406 3127.6273 3134.2584 3151.1827 3151.3526 3158.8402 3169.0407 3170.5005 3172.5625 3186.5598 3201.9126 3529.9144
redmass: 2.2593 6.1405 8.2746 7.9949 6.8249 5.5712 6.0615 5.5436 8.1849 5.0667 5.6784 6.6893 7.4763 5.5539 6.0523 6.5298 5.7378 8.9881 7.3122 3.2651 3.3519 5.7000 6.8202 2.8867 3.1908 6.2763 3.7024 6.9460 5.7087 1.9312 6.1686 6.9279 2.1775 6.1234 4.9253 9.7432 3.0338 6.4061 5.9220 4.2776 7.0592 2.6843 1.5129 3.3887 3.9010 1.5124 7.8780 7.6784 7.5341 1.4373 1.6147 1.5320 1.5795 5.7824 5.0713 1.6015 1.3821 5.5527 1.3540 1.3194 2.4415 4.0456 1.4571 2.7111 2.5390 1.0368 1.5337 1.5588 1.3376 1.2806 1.4722 1.6634 2.6368 2.0237 1.9757 1.9442 3.4251 2.8663 2.8511 3.5721 1.2938 4.3638 3.5369 3.8499 4.0216 3.0445 3.5136 3.8986 1.2067 4.1400 4.3913 6.7262 7.0940 7.3808 6.8562 7.3184 8.4654 8.0168 1.0534 1.1187 1.0881 1.0865 1.0913 1.0914 1.0953 1.0933 1.0977 1.0935 1.0956 1.0906 1.0642
irintensity: 15.1320 0.0071 0.2407 1.1938 0.2827 1.0589 0.2058 0.1002 0.5239 2.7274 1.0988 0.1604 2.1096 0.0908 0.1630 3.5174 0.0607 0.0851 1.9625 5.7271 7.6742 3.7922 14.0378 16.9619 0.9007 3.0841 3.4539 10.0507 30.7171 95.5853 43.7849 1.8793 53.5041 9.9602 1.2962 0.1590 2.6199 0.7378 4.8403 4.2740 9.3424 0.1826 101.9617 0.3770 10.5784 9.3056 24.0605 3.6243 26.1310 16.7522 50.0570 0.6731 34.7599 35.7057 53.1717 15.2001 4.2969 184.8497 4.9117 0.6745 1.1054 16.3362 4.4203 278.6870 24.7677 0.0002 31.8018 11.6189 72.2236 26.3585 65.4808 31.9165 319.8690 8.6021 49.2835 31.7949 63.7520 30.9816 31.0933 40.5629 2.4873 10.0607 4.4153 3.8916 19.1911 15.1352 91.5252 315.4338 15.1272 52.2720 41.1486 95.4907 170.7573 3.5913 0.1204 11.3157 170.4708 30.3065 172.2416 29.1742 10.6890 5.6910 4.8980 17.3536 15.5747 5.5430 16.0632 5.3190 15.8938 0.2881 57.2526
temp: 298.150 k
press: 1.00000 atm
elementType: 8 8 8 8 7 6 6 6 6 6 6 6 6 6 6 6 6 6 6 6 6 6 6 6 6 6 1 1 1 1 1 1 1 1 1 1 1 1 1
symmnumber: 1
zpe: 750155.9 jmol-1
zpe.correction: 0.285719 hartree
zpe.thermalcorrener: 0.304803 hartree
zpe.thermalcorrenthalpy: 0.305747 hartree
zpe.thermalcorrgfe: 0.236414 hartree
zpe.sumelectzpe: -1161.933503 hartree
zpe.sumelectthermal: -1161.914419 hartree
zpe.sumelectthermalent: -1161.913475 hartree
zpe.sumelectthermalfe: -1161.982808 hartree
dipole: -1.6915 -0.6272 0.0199
dipole: 1.8041
quadrupole: -128.3381 -128.1469 -153.7807
quadrupole: -1.8295 -0.1527 0.1192
quadrupole: 8.4172 8.6083 -17.0255 -1.8295 -0.1527 0.1192
hfenergy: -1162.219222 hartree
pointgroup: C01 [X(C21H13N1O4)]
dipole: 0.6784366 -0.1828831 0.1004708 debye
polarizability: 538.9072447|-6.0461587|232.7549015|3.7170566|-82.2834978|146.0718606 unknown
InChI: InChI=1S/C21H13NO4/c23-21(24)16-10-18(22-17-4-2-1-3-15(16)17)13-6-5-12-8-19-20(26-11-25-19)9-14(12)7-13/h1-10,23H,11H2
charge 0 multiplicity 1
39 atoms
O  5.883235 1.77774 -1.154663
O  6.745098 -0.088869 0.082853
O  -3.860473 -3.020317 1.700771
O  -5.771293 -1.902865 1.041407
N  -1.615055 0.896502 -0.475749
C  2.559311 0.286508 -0.167122
C  3.086433 -0.844091 0.582846
C  0.246582 -0.453612 0.321155
C  1.147581 0.44823 -0.274633
C  -1.219376 -0.22927 0.171577
C  4.817049 1.002328 -0.640634
C  5.332118 -0.109601 0.096867
C  3.463301 1.225608 -0.789597
C  4.508813 -1.034728 0.709883
C  2.154925 -1.749272 1.184132
C  0.777657 -1.565124 1.05971
C  -4.00956 0.259857 -0.150047
C  -2.183831 -1.16162 0.683173
C  -2.963928 1.146274 -0.63878
C  -3.55826 -0.935032 0.532774
C  7.131253 1.110394 -0.706252
C  -5.376843 0.623823 -0.375625
C  -3.323282 2.351089 -1.327495
C  -5.69205 1.807065 -1.051717
C  -4.663928 2.677782 -1.531595
C  -4.516876 -1.940025 1.08248
H  0.73255 1.29399 -0.832062
H  3.078601 2.07841 -1.354931
H  4.913367 -1.881277 1.2710
H  2.541092 -2.602262 1.754133
H  0.108142 -2.282535 1.543539
H  -1.864136 -2.069765 1.194218
H  7.694979 1.800552 -0.055566
H  7.704665 0.786763 -1.591482
H  -6.166532 -0.036227 -0.011434
H  -2.507406 2.99014 -1.678005
H  -6.742676 2.070945 -1.215708
H  -4.933489 3.599748 -2.058148
H  -4.550758 -3.649554 2.042725
