program: Gaussian 09
title: 000281448
version: EM64L-G09RevD.01
frameworkgroup: C1[X(C9H8F3NO3S2)]
method: RPBEPBE
basis: SDD
operation: Freq
keyword: #p
keyword: freq=noraman
keyword: PBEPBE/SDD
title: #p freq=noraman PBEPBE/SDD
converged: YES YES NO NO
title: Mulliken charges:
elementType: S S F F F O O O N C C C C C C C C C H H H H H H H H
charge: 0.871102 0.100297 -0.128967 -0.141253 -0.166522 -0.459722 -0.472021 -0.237186 -0.455087 -0.145363 0.505940 -0.209155 -0.159356 -0.311304 -0.429204 0.238006 0.156088 -0.775212 0.287636 0.296380 0.326613 0.240678 0.314739 0.217814 0.267699 0.267361
chargesum: 0.00000
title: Mulliken charges with hydrogens summed into heavy atoms:
elementType: S S F F F O O O N C C C C C C C C C
charge: 0.871102 0.100297 -0.128967 -0.141253 -0.166522 -0.459722 -0.472021 -0.237186 -0.140348 -0.145363 0.505940 0.078481 0.137024 0.015308 -0.188526 0.238006 0.156088 -0.022338
polarizability: 3.05593642e+02 -1.19471322e+01 1.48829598e+02 3.77960011e+00 -1.27063468e+01 1.36148018e+02
1716.lowfreq: -6.7424 -4.6673 -0.0011 -0.0010 0.0016 2.6466 17.2753 32.7873 36.2857
frequency: 16.9652 32.7632 36.2500 43.3592 45.0180 70.4767 79.4035 84.1833 98.7676 159.4552 165.7808 175.0242 177.2547 213.4061 284.3604 289.5782 307.0681 324.7211 343.7788 377.5266 403.2982 412.9061 415.9825 436.6185 462.3709 471.5870 521.1621 546.7926 596.3156 613.6632 651.8703 656.0489 672.4362 720.9525 807.6630 821.9718 824.9812 861.5942 928.7587 930.6233 952.9882 962.5667 975.3226 983.1096 995.0051 1000.8120 1001.7016 1041.1507 1045.1983 1125.9672 1187.9917 1212.4373 1268.9159 1296.2142 1368.4999 1392.3705 1412.6140 1447.9149 1467.5651 1472.6990 1495.9171 1585.3129 1593.0751 1633.9762 2999.5794 3100.3966 3103.5882 3132.6162 3162.4894 3178.2897 3196.0714 3531.9198
redmass: 9.6529 5.0266 1.8303 2.5913 8.3250 10.0938 4.4979 6.5383 7.5457 5.9710 15.2418 10.0857 9.8059 7.2196 13.9031 12.9916 8.1012 9.7512 6.1859 5.3939 8.1742 3.0299 23.5274 7.9620 17.8393 17.8348 2.8895 4.5793 3.0374 6.9788 16.5859 1.2179 6.2660 3.1661 16.2340 4.3732 1.4392 1.4842 6.1842 9.0513 12.1567 1.4944 5.4909 11.8966 1.6501 1.3346 12.4612 1.6465 2.3849 1.3031 1.1292 3.2412 1.9498 1.4080 3.7736 1.2192 4.9530 1.0447 1.3697 1.6003 2.3132 6.7418 5.3682 5.0560 1.0364 1.0987 1.1000 1.0908 1.0913 1.0953 1.0955 1.0767
irintensity: 1.0253 0.2589 1.9558 2.3958 2.6201 1.8318 4.1055 0.2776 2.7518 3.6961 0.5343 8.3903 1.2286 4.4456 5.6084 14.9197 2.5669 14.8613 36.2236 0.2418 40.3164 0.6503 1.8897 109.2777 0.8438 9.5899 65.9218 67.7293 1.5814 1.7433 26.2454 56.5072 1.1273 8.9266 80.6960 4.4016 25.0173 69.2691 1.4878 115.5806 128.4093 30.8048 21.6865 563.7749 9.2051 0.5956 182.0848 16.3955 47.5630 12.5269 53.5777 118.0029 61.9080 78.2926 305.9071 47.8648 19.6522 16.8285 11.0873 26.6017 473.6831 122.8280 72.8379 111.9018 7.9986 7.8957 11.9441 9.5236 6.1111 6.7784 18.3466 24.5685
temp: 298.150 k
press: 1.00000 atm
elementType: 16 16 9 9 9 8 8 8 7 6 6 6 6 6 6 6 6 6 1 1 1 1 1 1 1 1
symmnumber: 1
zpe: 427108.8 jmol-1
zpe.correction: 0.162677 hartree
zpe.thermalcorrener: 0.182007 hartree
zpe.thermalcorrenthalpy: 0.182951 hartree
zpe.thermalcorrgfe: 0.111053 hartree
zpe.sumelectzpe: -1722.339330 hartree
zpe.sumelectthermal: -1722.320000 hartree
zpe.sumelectthermalent: -1722.319056 hartree
zpe.sumelectthermalfe: -1722.390954 hartree
dipole: 8.3606 -3.7547 2.0737
dipole: 9.3967
quadrupole: -113.5566 -124.6848 -120.0802
quadrupole: -13.4479 15.8346 -5.5613
quadrupole: 5.8840 -5.2443 -0.6397 -13.4479 15.8346 -5.5613
hfenergy: -1722.5020069 hartree
pointgroup: C01 [X(C9H8F3N1O3S2)]
dipole: -3.2840404 -1.114777 1.2805422 debye
dipolederiv: 2.2394442 0.2003584 0.098742 0.4603055 0.9519722 0.3089368 0.0890089 0.1958928 1.4738511 -0.6464984 -0.0296911 -0.1930228 0.0065461 -0.2040168 0.0949599 -0.5047402 -0.0504663 -0.5546685 -0.7438051 0.2661011 -0.017775 0.5685988 -0.5049217 0.1183599 0.0129109 -0.0392496 -0.3432123 -0.4388561 -0.0424605 -0.255053 0.1122444 -0.2809276 0.0249823 -0.5654105 -0.1797316 -0.9464576 -0.5783516 -0.161399 0.1497123 -0.0451366 -0.4321779 0.302173 -0.0846909 0.1043414 -0.4343443 -0.6495254 -0.0122379 0.0405019 0.013969 -0.5392848 -0.2189123 0.0624699 -0.0350104 -0.4412715 -0.6478273 -0.038216 -0.0495255 -0.0881862 -0.376321 0.1393593 0.0468905 -0.0070176 -0.6405747 -0.8009995 -0.002992 0.1098897 0.5215188 -0.7714932 0.1192129 -0.1516232 0.244 -0.4458168 -2.4001318 0.2384697 0.3490229 0.3855339 -0.4022522 -0.0622525 0.3866089 -0.0332459 -0.3835505 -0.4335522 0.0076438 0.0966848 0.1042382 -0.1120474 -0.0537017 0.3599698 -0.0080549 -0.2807158 1.6066167 -0.0021979 -0.3552513 0.2861198 0.1118583 -0.0602566 -0.6374417 0.0142332 0.2824693 0.2424162 0.0361249 -0.1331561 -0.4567224 -0.0375379 0.0154659 -0.0675394 -0.070656 -0.0089851 0.0991961 -0.081162 -0.0337854 0.2433552 0.0077743 -0.0718195 -0.3709743 -0.0404099 0.0307731 -0.4655584 -0.1006306 0.107181 -0.293238 -0.0926162 0.0584732 0.2958539 0.0151579 -0.1952262 -0.6074024 0.0516869 0.041458 0.2797972 0.0005016 -0.153667 0.0246472 -0.1174733 -0.095792 2.1077204 -0.2466263 -0.3580558 -1.0817292 0.9781778 -0.1651144 -0.0348905 -0.3572629 0.4292372 1.7547809 -0.0987363 0.1615428 -0.9574486 1.1544669 -0.7054868 0.7419055 0.0561992 1.7873717 -0.4535997 -0.1002456 0.1844608 -0.0527728 0.0141626 0.0081207 0.2163982 0.0256442 -0.0874366 0.1287114 -0.0317286 0.049752 -0.0186788 0.0888351 0.0231884 0.0006303 0.0431176 0.108315 0.0972123 0.0641802 -0.0006403 0.0256062 0.1133941 0.0222247 -0.0145416 0.0001541 0.1227194 0.1873807 0.0395998 -0.0211488 -0.0042322 0.1145308 0.0343835 0.0742234 0.0325744 0.1584605 0.0256933 -0.0586061 0.0634428 -0.0239577 0.0202712 0.0883812 0.1051652 0.1083088 0.0897293 0.1937106 0.0425681 0.0169112 0.0620507 0.1545254 0.0740706 0.0154968 0.0711843 0.2524105 0.0530339 0.0725069 -0.0149471 -0.0163616 -0.0906557 0.1135658 0.0299172 0.0886425 0.0653585 0.0235127 -0.0196683 -0.0647782 -0.0425441 0.1141176 0.0300899 -0.1092615 -0.0004692 0.0280202 0.1066784 0.0073584 0.0278371 0.0111247 0.0196646 -0.0847371 0.0790175 -0.0604028 0.0293359 unknown
polarizability: 305.4164249|4.9798782|142.601972|-12.7284865|-14.1683952|142.5528618 unknown
InChI: InChI=1S/C8H8NO3S.CF3S/c1-6(10)9-7-2-4-8(5-3-7)13(11)12;2-1(3,4)5/h2-5,9H,1H3;
charge 0 multiplicity 1
26 atoms
S  1.899913 0.068846 -1.639625
S  3.200322 1.403143 0.137801
F  4.543278 -0.89357 0.826888
F  4.029497 0.517352 2.524054
F  2.417124 -0.787255 1.583164
O  2.556269 -1.414043 -1.737602
O  1.881023 1.104095 -2.890407
O  -4.811166 1.442336 -0.153086
N  -3.710585 -0.496232 0.584397
C  0.172871 -0.075603 -0.942294
C  -2.414517 -0.310702 0.048958
C  -0.742302 0.955493 -1.214615
C  -0.140074 -1.217798 -0.1838
C  -2.054718 0.834229 -0.720559
C  -1.451258 -1.330428 0.304539
C  -4.831754 0.347605 0.475441
C  3.566947 0.008448 1.291804
C  -6.082002 -0.162916 1.181426
H  -0.449952 1.821013 -1.81719
H  0.606921 -1.993245 0.006081
H  -2.802283 1.603823 -0.91878
H  -1.727488 -2.213906 0.892238
H  -3.848254 -1.356456 1.120178
H  -5.958959 -1.148312 1.662465
H  -6.905307 -0.224424 0.449566
H  -6.384649 0.570909 1.94826
