program: Gaussian 09
title: 000281488
version: EM64L-G09RevD.01
frameworkgroup: C1[X(C14H18N4O5)]
method: RPBEPBE
basis: SDD
operation: Freq
keyword: #p
keyword: freq=noraman
keyword: PBEPBE/SDD
title: #p freq=noraman PBEPBE/SDD
converged: YES YES NO NO
title: Mulliken charges:
elementType: O O O O O N N N N C C C C C C C C C C C C C C H H H H H H H H H H H H H H H H H H
charge: -0.438032 -0.189353 -0.201866 -0.187160 -0.183523 -0.103834 -0.470467 0.018503 0.017946 0.131936 -0.458789 -0.418515 0.205675 -0.401955 -0.563312 -0.336015 -0.710310 0.576621 -0.609241 -0.533097 0.485443 0.484540 -0.548195 0.207434 0.212655 0.219477 0.203840 0.212000 0.218734 0.215916 0.243705 0.185387 0.215375 0.214505 0.244430 0.213851 0.356960 0.316651 0.286810 0.329102 0.336166
chargesum: 0.00000
title: Mulliken charges with hydrogens summed into heavy atoms:
elementType: O O O O O N N N N C C C C C C C C C C C C C C
charge: -0.081072 -0.189353 -0.201866 -0.187160 -0.183523 -0.103834 -0.153816 0.018503 0.017946 0.131936 -0.038700 0.004802 0.205675 0.028780 -0.103691 0.064747 -0.037524 0.576621 -0.322431 -0.203994 0.485443 0.484540 -0.212029
polarizability: 3.32431609e+02 1.50755626e+00 2.27160503e+02 4.08740436e+00 -4.53648352e+00 1.15345888e+02
1716.lowfreq: -5.4178 -0.0002 0.0008 0.0008 2.4738 6.8052 16.8149 27.6572 43.6459
frequency: 16.7220 27.6281 43.6402 50.1499 52.6144 60.7075 107.9323 125.2202 130.8688 133.1578 159.5685 163.7304 191.9082 196.2786 202.6412 240.1597 259.5536 289.5523 299.3506 336.3147 339.8119 342.6603 371.5514 399.0588 417.0913 437.0623 461.6749 469.3066 484.4738 497.7767 513.0523 517.5146 545.4561 552.1027 581.0436 600.5407 635.3880 674.3782 685.3074 704.0564 718.1811 726.1513 764.6256 803.4482 829.1465 855.9642 870.6929 897.4710 910.1861 913.2391 936.8412 940.2145 952.7085 956.4409 965.4091 980.2901 1000.7868 1021.4690 1036.0842 1065.8635 1085.4738 1094.0313 1098.7580 1115.2841 1121.2712 1147.3129 1171.9938 1191.7846 1199.3401 1208.4756 1217.3591 1234.4483 1258.7797 1268.7691 1285.2050 1296.7765 1304.3093 1328.9636 1341.8416 1346.1481 1358.1722 1375.4086 1383.4331 1389.2761 1390.3693 1398.8208 1443.9170 1458.2658 1462.0401 1467.8803 1473.6104 1474.9750 1478.1145 1479.3908 1481.3052 1509.6462 1552.8901 1592.0062 1634.0490 2924.5363 2938.6520 2971.9024 2973.5413 2982.6991 2988.4183 2991.5915 3030.3744 3038.0613 3043.8576 3053.7432 3078.8049 3112.5957 3160.9459 3205.2513 3206.7078 3360.2127 3474.5107
redmass: 5.3404 4.2183 5.8724 8.2563 12.8042 6.9188 6.8638 2.8503 3.6170 6.4254 4.6490 3.5736 3.4248 4.3296 1.3430 3.8599 2.7260 4.3259 2.4908 6.4261 4.4891 3.3157 3.4934 2.1687 3.6748 3.0246 1.5076 5.4215 1.7673 4.3175 3.5857 2.5699 3.3022 4.0515 4.5749 4.0681 3.0434 3.0849 12.0049 3.1982 7.4257 8.0919 6.0765 1.8901 2.2509 2.2404 8.9172 1.9761 1.7034 1.5158 1.4953 1.8868 1.6348 1.9506 3.5956 6.1951 3.9982 1.8006 1.8394 1.7826 2.4764 1.8560 1.7876 1.4760 1.5503 2.3484 2.1928 2.2506 1.2487 14.2727 10.5771 1.2526 1.3209 1.5650 1.5809 1.7286 1.8520 1.4589 1.4189 1.4679 1.4856 4.7595 6.5179 1.3911 3.3083 1.4078 1.1538 4.0233 1.0669 1.0786 1.0904 1.0862 1.1946 1.2271 1.7917 3.0061 5.4632 5.7791 7.9836 1.0605 1.0661 1.0888 1.0615 1.0635 1.0376 1.0697 1.0993 1.0964 1.0984 1.1038 1.0997 1.0986 1.0920 1.0915 1.0932 1.0663 1.0753
irintensity: 0.4908 1.0363 0.1389 0.4174 0.0659 0.3491 1.9895 0.8580 10.2983 3.3133 3.0781 1.6211 3.0056 0.7499 0.3300 1.3936 1.1939 1.3028 0.9964 3.2745 0.6045 4.0887 1.2690 3.9936 3.8565 3.2099 56.2036 0.1820 57.3412 13.5482 0.4231 43.7849 4.0618 1.7537 2.8887 11.9547 2.5739 2.2292 36.3256 38.6023 55.4506 0.0113 1.2100 4.6149 10.5836 14.2577 21.6864 6.3194 4.3780 6.9153 24.5903 20.5128 35.1352 8.1625 4.6160 4.9544 52.4417 14.0045 14.7403 86.3356 130.4762 3.0794 3.2194 5.2598 3.1138 4.5766 14.2950 4.5181 12.2164 344.5616 89.9661 2.0960 11.0177 42.1475 58.4542 68.8796 27.9692 13.6952 0.2664 1.7697 2.1273 79.8589 65.4911 22.2522 49.6245 24.2099 15.4975 31.3244 7.4866 7.4002 3.6604 14.5544 22.1153 55.3988 62.7264 285.7174 41.9774 3.9360 294.1020 10.0033 78.6326 12.6947 25.7397 33.5792 33.3326 47.0714 17.3040 52.2638 60.0523 55.0717 35.6661 17.0463 8.7212 17.4040 32.0154 70.6446 28.5477
temp: 298.150 k
press: 1.00000 atm
elementType: 8 8 8 8 8 7 7 7 7 6 6 6 6 6 6 6 6 6 6 6 6 6 6 1 1 1 1 1 1 1 1 1 1 1 1 1 1 1 1 1 1
symmnumber: 1
zpe: 832113.5 jmol-1
zpe.correction: 0.316935 hartree
zpe.thermalcorrener: 0.338908 hartree
zpe.thermalcorrenthalpy: 0.339852 hartree
zpe.thermalcorrgfe: 0.263997 hartree
zpe.sumelectzpe: -1137.492459 hartree
zpe.sumelectthermal: -1137.470486 hartree
zpe.sumelectthermalent: -1137.469542 hartree
zpe.sumelectthermalfe: -1137.545397 hartree
dipole: -8.4958 -5.0828 -1.9486
dipole: 10.0901
quadrupole: -149.0877 -154.9878 -139.6993
quadrupole: 10.2373 4.5322 -1.7084
quadrupole: -1.1627 -7.0628 8.2256 10.2373 4.5322 -1.7084
hfenergy: -1137.8093941 hartree
pointgroup: C01 [X(C14H18N4O5)]
dipole: 3.1169573 1.9368628 -1.5139525 debye
polarizability: 328.1237453|2.3522611|225.201207|-29.7542216|-16.4963402|121.6130481 unknown
InChI: InChI=1S/C14H18N4O5/c1-14(9-19)5-3-2-4-13(14)16-15-10-6-11(17(20)21)8-12(7-10)18(22)23/h6-8,15,19H,2-5,9H2,1H3
charge 0 multiplicity 1
41 atoms
O  2.81784 -1.131375 2.037623
O  -1.836257 -3.601675 0.537585
O  -4.135208 3.16811 0.316215
O  -4.044182 -3.148806 0.883731
O  -5.629183 1.488975 0.702726
N  1.40038 0.039344 -0.142786
N  0.33037 0.928675 -0.161395
N  -2.830033 -2.788471 0.646042
N  -4.438234 1.923508 0.478601
C  3.736454 -0.555899 -0.255547
C  5.068968 -0.127211 -0.941022
C  5.371395 1.384308 -0.884726
C  2.609114 0.466026 -0.485052
C  4.238466 2.154055 -1.588808
C  2.881986 1.913033 -0.885643
C  3.970569 -0.631022 1.303452
C  3.341639 -1.96779 -0.768455
C  -0.964079 0.462707 0.079855
C  -2.031815 1.396151 0.159709
C  -1.234162 -0.924067 0.240849
C  -2.558072 -1.329232 0.483001
C  -3.334617 0.925301 0.400093
C  -3.643729 -0.437007 0.572149
H  5.028207 -0.43153 -2.0065
H  5.892898 -0.708393 -0.482855
H  6.336824 1.588959 -1.384278
H  5.47506 1.731324 0.162819
H  4.174891 1.815851 -2.641678
H  4.444766 3.240245 -1.611529
H  2.067148 2.275681 -1.548424
H  2.83944 2.541656 0.03276
H  4.271522 0.368114 1.688449
H  4.794642 -1.342098 1.497345
H  4.197069 -2.6576 -0.643745
H  2.488506 -2.381383 -0.208737
H  3.07547 -1.934171 -1.840001
H  1.992594 -0.846689 1.547551
H  0.471479 1.932596 -0.312411
H  -1.873194 2.473075 0.043241
H  -0.433177 -1.661583 0.171359
H  -4.662155 -0.780791 0.760337
