program: Gaussian 09
title: 000281453
version: EM64L-G09RevD.01
frameworkgroup: C1[X(C24H26N4O4)]
method: RPBEPBE
basis: SDD
operation: Freq
keyword: #p
keyword: freq=noraman
keyword: PBEPBE/SDD
title: #p freq=noraman PBEPBE/SDD
converged: YES YES NO NO
title: Mulliken charges:
elementType: O O O O N N N N C C C C C C C C C C C C C C C C C C C C C C C C H H H H H H H H H H H H H H H H H H H H H H H H H H
charge: -0.230042 -0.230074 -0.230076 -0.230034 -0.103429 -0.103392 -0.158528 -0.158520 -0.346967 -0.346838 -0.447356 -0.444535 -0.444411 -0.447264 0.201566 0.199997 0.199906 0.201546 -0.581556 -0.581560 0.506078 0.506101 -0.383927 -0.383335 -0.383329 -0.383932 -0.234467 -0.234328 -0.234331 -0.234468 -0.235181 -0.235181 0.212867 0.217368 0.212815 0.217362 0.218430 0.266697 0.257068 0.222127 0.222087 0.257099 0.266703 0.218432 0.253647 0.253259 0.253263 0.253648 0.261278 0.261933 0.261933 0.261266 0.226254 0.226416 0.226414 0.226252 0.228625 0.228627
chargesum: 0.00000
title: Mulliken charges with hydrogens summed into heavy atoms:
elementType: O O O O N N N N C C C C C C C C C C C C C C C C C C C C C C C C
charge: -0.230042 -0.230074 -0.230076 -0.230034 -0.103429 -0.103392 -0.158528 -0.158520 0.083268 0.083339 0.037771 0.034660 0.034775 0.037870 0.201566 0.199997 0.199906 0.201546 -0.074650 -0.074649 0.506078 0.506101 -0.122649 -0.121402 -0.121396 -0.122666 -0.008213 -0.007911 -0.007917 -0.008216 -0.006556 -0.006555
polarizability: 2.99405779e+02 4.17443800e+01 2.60700224e+02 2.06882989e+01 -1.91949584e+01 2.88078800e+02
1716.lowfreq: -6.1654 -5.2700 -4.5521 -2.9729 -0.0008 -0.0006 0.0005 8.5730 16.1941
frequency: -5.3013 8.5723 16.1753 20.0266 26.2989 37.8943 52.8535 55.4227 56.1543 65.9897 77.6706 99.1637 101.0453 104.8722 116.3709 172.0659 180.4970 195.3291 208.7670 213.6835 227.1558 241.5913 287.3217 294.7935 314.3303 316.8675 359.8712 392.4910 398.4001 399.3163 404.8895 404.9688 406.3045 414.4360 444.5882 449.7847 474.8338 489.5330 506.3753 543.5341 544.0274 572.2782 579.1289 584.2983 611.8479 616.3109 617.5611 618.1333 621.9502 656.5679 673.8960 706.2519 708.0847 721.8608 726.9942 782.9720 783.3596 792.1756 823.2011 823.3041 863.8683 863.9251 888.6491 890.4388 892.7979 902.7468 940.4077 940.5046 959.2006 960.4837 983.2047 987.3254 987.3777 987.5171 990.3037 990.3196 1000.7739 1000.7966 1017.5623 1027.3247 1027.3759 1032.3871 1043.0379 1048.3545 1066.2575 1072.5082 1091.1712 1094.1535 1130.7151 1137.0880 1140.8323 1166.9166 1170.2666 1173.2033 1173.4875 1189.7965 1189.8300 1214.0018 1214.0115 1220.9693 1230.5784 1233.0373 1246.0519 1260.3986 1278.7308 1291.6135 1303.6628 1307.5193 1307.8745 1318.9914 1322.2257 1325.4168 1345.6753 1350.1184 1350.3324 1361.7957 1369.8170 1375.1235 1376.7130 1386.0578 1386.0843 1399.5291 1443.3223 1443.7635 1445.1520 1445.4165 1454.0963 1455.0268 1459.1272 1459.2814 1471.8833 1482.0202 1484.8826 1484.9324 1590.1758 1590.5955 1596.1571 1596.3239 1613.9509 1613.9728 1638.9770 1640.3039 2826.7914 2826.8290 2832.4371 2833.5259 2895.1816 2909.4261 3025.3343 3046.5589 3050.8976 3050.9162 3071.9040 3072.0709 3079.3852 3079.6092 3113.3245 3113.3273 3122.8690 3122.8731 3130.4243 3130.4703 3141.0431 3141.0794 3150.3007 3150.3446 3164.0393 3164.0504
redmass: 5.7845 5.8202 6.5168 4.2097 3.9879 6.8122 5.6247 4.7525 4.5853 4.1692 4.5218 4.3343 7.5387 4.1519 3.1642 4.5317 3.3889 4.2620 3.5687 4.6187 5.2612 4.7626 4.0139 6.3037 2.6770 2.6694 3.5344 5.6790 2.8309 2.2438 2.8107 2.8412 3.3192 5.8896 4.4474 4.3047 4.8733 3.8635 5.3831 4.1119 3.8418 4.1171 3.7139 7.2843 4.6677 4.6701 6.2370 5.4162 3.9891 4.9129 4.9837 2.4544 2.0553 1.9693 2.4118 2.6315 2.6972 1.2112 3.4661 3.4862 1.2432 1.2430 2.2613 4.1099 2.2825 4.0197 1.4715 1.4693 1.9715 1.9422 2.8973 1.4744 1.4379 2.3616 5.6605 5.6445 1.3331 1.3341 2.8833 2.2594 2.2534 2.5776 3.2720 4.2583 2.3627 2.6624 1.6174 1.6537 2.2432 2.6973 2.4334 1.3832 1.3151 1.0575 1.0793 1.1252 1.1252 2.8982 2.8983 2.6855 1.4281 1.7945 1.5654 1.2435 1.5012 1.2975 1.5201 3.3882 2.6220 1.6508 1.5758 1.3692 1.5331 1.6658 1.6783 1.4482 1.4334 1.5526 1.5856 5.4165 5.3984 1.3976 1.2145 1.3480 1.7440 1.5214 1.1040 1.1011 1.1300 1.1304 1.0919 1.0917 2.1985 2.2038 9.0461 8.8049 6.9327 7.0942 6.0142 6.0137 10.1139 10.1298 1.0713 1.0714 1.0691 1.0691 1.0693 1.0690 1.0879 1.0932 1.0585 1.0585 1.0866 1.0866 1.0871 1.0871 1.1058 1.1058 1.0847 1.0847 1.0880 1.0880 1.0927 1.0927 1.0968 1.0968 1.1017 1.1017
irintensity: 0.2005 0.0503 0.0000 1.0176 0.0000 0.2849 3.1541 0.0092 1.3641 0.0001 0.0000 7.9319 0.0017 7.4073 0.0006 7.5145 0.0001 0.0001 0.9834 0.0000 3.3649 0.0000 0.0001 14.9058 0.0063 10.0097 17.0497 0.0000 23.4462 0.0124 2.0488 0.0040 22.8398 7.2349 0.0000 3.4850 0.0000 50.2214 0.0001 0.4954 0.0005 0.0001 6.8072 18.6253 0.0000 0.0005 2.2086 0.0005 32.1989 46.3980 0.0000 69.1189 0.0020 127.0188 0.0005 28.2151 0.0001 0.8098 14.4614 0.0556 0.7482 1.3918 0.0015 23.8804 15.4151 0.0000 0.9254 13.9297 0.0005 5.5449 0.0000 2.1873 0.7217 3.7977 0.0104 0.1630 0.3020 1.0765 0.0001 13.6998 0.5732 0.2900 0.0004 44.0715 0.0000 0.0001 49.8360 0.0003 228.1888 0.0084 37.2138 0.0003 98.2700 0.0002 11.1143 2.8235 0.8834 16.1777 0.7403 0.0003 128.3984 0.0012 64.1773 0.0000 38.1033 0.0004 135.2177 0.0266 251.8992 0.0004 95.6406 0.0001 0.8380 0.6931 97.3440 0.0001 50.6112 0.0056 54.0515 0.3906 17.0742 0.0000 0.0067 5.5863 0.0048 6.3330 44.0554 0.1070 58.2625 2.1515 0.0004 16.7381 29.8171 3.1090 0.0044 532.9101 0.0258 191.6095 2.8923 1.8870 115.0413 0.0001 1.5576 64.3396 199.4595 0.0075 0.0018 143.0229 0.0001 36.0171 29.9772 1.2286 0.2202 13.5464 0.0130 12.8663 0.0164 0.0163 0.2649 0.1765 3.6543 3.8024 16.5198 14.4033 20.3076 28.1498 32.6851 10.5394
temp: 298.150 k
press: 1.00000 atm
elementType: 8 8 8 8 7 7 7 7 6 6 6 6 6 6 6 6 6 6 6 6 6 6 6 6 6 6 6 6 6 6 6 6 1 1 1 1 1 1 1 1 1 1 1 1 1 1 1 1 1 1 1 1 1 1 1 1 1 1
symmnumber: 1
zpe: 1217786.8 jmol-1
zpe.correction: 0.463831 hartree
zpe.thermalcorrener: 0.491758 hartree
zpe.thermalcorrenthalpy: 0.492703 hartree
zpe.thermalcorrgfe: 0.400379 hartree
zpe.sumelectzpe: -1447.744660 hartree
zpe.sumelectthermal: -1447.716732 hartree
zpe.sumelectthermalent: -1447.715788 hartree
zpe.sumelectthermalfe: -1447.808111 hartree
dipole: 0.0005 0.0000 0.0051
dipole: 0.0052
quadrupole: -212.1480 -177.8721 -200.0025
quadrupole: 15.1221 3.4685 7.1633
quadrupole: -15.4738 18.8021 -3.3283 15.1221 3.4685 7.1633
hfenergy: -1448.2084902 hartree
pointgroup: C01 [X(C24H26N4O4)]
dipole: -0.0002201 -0.0002417 -0.0020071 debye
polarizability: 300.395601|-38.3873852|265.3239496|25.4509948|22.4976667|282.4652527 unknown
InChI: InChI=1S/C24H26N4O4/c29-21-15-25(16-22(30)27(21)13-19-7-3-1-4-8-19)11-12-26-17-23(31)28(24(32)18-26)14-20-9-5-2-6-10-20/h1-10H,11-18H2
charge 0 multiplicity 1
58 atoms
O  -4.54512 -2.562502 -1.395875
O  -4.134461 -0.466583 2.752005
O  4.139158 0.463794 -2.752438
O  4.541602 2.56842 1.391811
N  -1.696839 -0.864786 0.08879
N  1.696472 0.866935 -0.094566
N  -4.376533 -1.430091 0.639254
N  4.377093 1.431519 -0.641146
C  -0.238313 -0.722469 -0.134411
C  0.23756 0.724966 0.126289
C  -2.297136 -1.993761 -0.642995
C  -2.083526 -0.908869 1.509378
C  2.085832 0.908092 -1.51452
C  2.295151 1.997628 0.635905
C  -3.819191 -2.016569 -0.523436
C  -3.599427 -0.897274 1.6962
C  3.602083 0.896402 -1.698453
C  3.817422 2.020512 0.519163
C  -5.872309 -1.406657 0.775471
C  5.873127 1.408005 -0.774414
C  -6.492154 -0.137596 0.202611
C  6.492033 0.140336 -0.197458
C  -6.691178 0.998723 1.02773
C  6.881663 0.08949 1.16533
C  -6.884328 -0.083568 -1.159326
C  6.692706 -0.99786 -1.019582
C  -7.270109 2.173327 0.497246
C  7.459156 -1.084233 1.699162
C  -7.462715 1.091433 -1.689363
C  7.270745 -2.171185 -0.485306
C  -7.657438 2.22258 -0.862357
C  7.655525 -2.217265 0.875133
H  0.364971 -1.416541 0.49846
H  -0.039632 -0.991015 -1.188293
H  -0.364597 1.418952 -0.507764
H  0.037239 0.993956 1.17975
H  -1.919933 -2.993502 -0.298031
H  -2.066663 -1.914177 -1.718126
H  -1.700216 -0.027605 2.047275
H  -1.68245 -1.814816 2.038255
H  1.685578 1.812839 -2.04607
H  1.703763 0.025587 -2.051259
H  2.062648 1.920342 1.71077
H  1.918371 2.996526 0.288054
H  -6.240948 -2.298317 0.243635
H  -6.083296 -1.495507 1.853107
H  6.086185 1.494404 -1.851843
H  6.240607 2.300938 -0.24391
H  -6.383776 0.957889 2.079184
H  6.723661 0.968588 1.800886
H  -6.727557 -0.961207 -1.797196
H  6.387286 -0.959466 -2.071706
H  -7.422674 3.045858 1.142449
H  7.75943 -1.114248 2.752645
H  -7.764953 1.123905 -2.742212
H  7.424605 -3.045187 -1.128207
H  -8.109828 3.132588 -1.272784
H  8.107228 -3.12628 1.288504
