program: Gaussian 09
title: 000281406
version: EM64L-G09RevD.01
frameworkgroup: C1[X(C21H18ClN5O4S)]
method: RPBEPBE
basis: SDD
operation: Freq
keyword: #p
keyword: freq=noraman
keyword: PBEPBE/SDD
title: #p freq=noraman PBEPBE/SDD
converged: YES YES NO NO
title: Mulliken charges:
elementType: Cl S O O O O N N N N N C C C C C C C C C C C C C C C C C C C C C H H H H H H H H H H H H H H H H H H
charge: -0.055237 0.974085 -0.538980 -0.481986 -0.248538 -0.175152 -0.641002 -0.441578 -0.109293 -0.087594 -0.073384 -0.057422 -0.230336 -0.145855 -0.341119 0.186033 -0.270288 -0.348866 0.156390 0.290521 0.217783 0.504995 -0.323728 -0.331643 -0.436839 -0.763594 -0.197224 -0.180275 -0.145673 -0.121151 -0.317634 -0.191434 0.294547 0.298517 0.285728 0.341821 0.278783 0.267723 0.359838 0.233594 0.307718 0.234752 0.244055 0.291803 0.255113 0.256874 0.257069 0.243345 0.238542 0.236196
chargesum: 0.00000
title: Mulliken charges with hydrogens summed into heavy atoms:
elementType: Cl S O O O O N N N N N C C C C C C C C C C C C C C C C C C C C C
charge: -0.055237 0.974085 -0.538980 -0.481986 -0.248538 -0.175152 -0.299181 -0.081740 -0.109293 -0.087594 -0.073384 -0.057422 0.064211 0.152661 -0.055391 0.186033 0.008495 -0.081143 0.156390 0.290521 0.217783 0.504995 -0.090135 -0.023924 -0.202086 0.027377 0.059650 0.076793 0.097673 -0.121151 -0.079093 0.044762
polarizability: 4.53996888e+02 1.52531729e+01 3.50443909e+02 -9.59425717e+00 -2.23201970e+01 2.76628005e+02
1716.lowfreq: -4.8671 -2.8707 -0.0016 -0.0013 -0.0008 1.0799 6.9892 13.4290 16.9061
frequency: 6.7762 13.3775 16.7497 19.4319 33.2052 37.8561 43.5684 48.7528 58.2487 63.7511 71.7492 86.4168 90.4461 117.5260 126.9264 130.1197 143.8840 168.5971 178.1503 189.4054 201.2404 211.1020 221.9774 248.2667 257.3988 268.4442 306.6787 314.8383 342.2454 344.7209 355.3401 377.1882 386.2963 407.7570 409.8142 411.2212 424.5645 426.2702 442.3748 450.8781 498.1376 505.3579 513.3233 517.4110 545.3302 584.5589 591.0913 605.3267 617.4669 623.0843 623.9859 652.6407 684.1516 706.8153 708.9056 722.9692 737.2233 739.5458 774.7368 793.8723 801.9701 811.4964 832.5108 835.2981 843.2734 846.2693 846.6741 853.2340 868.9230 871.5451 935.4314 943.1116 948.6010 950.2081 950.7714 959.5049 969.9962 979.2201 986.5100 987.4707 993.7543 994.6752 1026.1392 1036.0014 1039.6760 1044.0190 1073.8637 1095.8698 1108.5617 1115.2749 1141.0673 1154.1494 1163.5136 1166.6017 1184.3745 1190.2418 1207.3100 1214.2388 1257.5770 1275.6502 1287.1542 1297.1415 1309.0387 1320.1523 1348.6412 1370.1475 1376.9901 1394.1252 1395.0521 1402.8374 1418.5845 1429.6391 1442.4340 1452.5820 1453.6242 1456.2446 1479.0359 1517.5296 1557.9520 1578.2562 1580.9092 1591.7773 1592.9484 1606.0109 1622.9268 1644.3136 2980.6386 3008.3919 3064.9076 3125.0446 3129.7331 3135.5794 3141.8246 3156.3794 3159.7802 3166.1676 3166.3817 3174.1500 3175.5296 3181.4769 3188.8518 3193.7777 3362.7741 3486.4493
redmass: 7.8717 7.4508 7.1357 5.6701 6.9167 4.8855 4.5600 6.3837 4.5117 5.4837 7.5268 7.7370 8.2629 7.2509 7.9501 6.6225 1.0909 7.4630 8.9902 6.2493 6.6394 8.5810 8.2666 8.4454 9.0593 5.6150 9.0483 8.4821 6.3374 7.0731 7.7710 5.7369 6.4411 3.5468 3.0473 2.9931 6.5498 7.3859 9.4100 1.5347 3.5207 3.7613 2.8497 3.3731 3.5221 4.8497 6.6582 6.8675 6.9119 6.2782 7.1746 6.1394 5.5581 3.4731 3.1599 4.3448 3.1909 2.3339 2.0891 2.7930 1.6310 9.4094 1.7199 1.3332 1.7903 2.5921 1.7238 5.2544 1.3347 2.0588 4.0374 1.3663 3.5701 2.3033 2.2460 7.4932 1.4032 1.3250 1.3349 1.8739 2.5301 4.1770 1.8769 4.6484 2.2802 2.5098 2.6560 1.6047 1.2941 1.3338 2.3436 1.9898 1.6953 1.0722 1.1164 2.0476 1.4134 1.9016 1.9172 1.5150 1.2717 1.3703 2.0910 3.6502 2.0308 5.0617 1.2743 10.3134 3.3436 3.9253 2.1936 9.2581 1.0544 1.0797 2.2897 2.2089 2.3953 2.1675 5.7774 6.2681 5.9633 6.8249 5.9886 6.1815 6.9777 8.3899 1.0377 1.0829 1.0952 1.1011 1.0904 1.0888 1.0891 1.0888 1.0954 1.0910 1.0898 1.0954 1.0964 1.1007 1.0967 1.0958 1.0772 1.0776
irintensity: 0.6514 0.4512 0.1081 0.5799 0.8679 3.8281 1.6704 0.4711 0.2127 4.9110 3.1526 0.5340 2.4149 0.6625 2.4343 0.2421 0.1668 7.1908 4.0845 5.2656 8.7525 0.2152 1.3795 9.3234 6.6098 5.3080 16.0776 16.4083 2.8347 2.0493 11.1411 10.2365 19.1635 4.2366 10.3722 0.0249 64.5764 8.4020 97.5852 62.1454 3.1496 74.3491 20.3419 30.3530 11.5142 10.8796 33.4436 6.5178 0.5462 4.4045 2.0854 24.2584 0.5965 4.4423 188.4040 3.9147 34.6082 36.6099 61.7034 18.9666 12.9778 108.5307 46.4313 25.0592 5.5653 26.4100 137.0398 31.9330 0.4409 20.8980 30.8537 2.4959 21.3755 7.2245 22.6228 25.0939 1.4531 2.5391 0.3780 3.9616 0.9345 30.2411 19.6984 31.4586 5.3172 19.0051 54.3708 6.0130 3.0130 29.2199 207.6668 112.0125 43.0712 6.0430 4.2628 16.8312 14.4441 23.4135 8.0420 8.9266 3.3115 5.6287 23.3243 71.7195 18.3438 67.1762 88.4401 14.4676 12.2577 19.4547 83.2545 7.3224 22.8636 27.5103 125.7110 16.7172 98.9889 619.7770 12.8536 54.1138 94.2349 17.8838 32.9060 3.4081 258.6125 108.9484 5.5782 12.7476 4.3381 6.7169 10.7727 14.3051 2.1865 3.3623 17.4111 2.9440 2.1393 1.7530 0.3266 19.2335 4.8641 4.2022 208.7440 45.7835
temp: 298.150 k
press: 1.00000 atm
elementType: 17 16 8 8 8 8 7 7 7 7 7 6 6 6 6 6 6 6 6 6 6 6 6 6 6 6 6 6 6 6 6 6 1 1 1 1 1 1 1 1 1 1 1 1 1 1 1 1 1 1
symmnumber: 1
zpe: 936843.2 jmol-1
zpe.correction: 0.356825 hartree
zpe.thermalcorrener: 0.387463 hartree
zpe.thermalcorrenthalpy: 0.388408 hartree
zpe.thermalcorrgfe: 0.288102 hartree
zpe.sumelectzpe: -2241.325607 hartree
zpe.sumelectthermal: -2241.294969 hartree
zpe.sumelectthermalent: -2241.294025 hartree
zpe.sumelectthermalfe: -2241.394330 hartree
dipole: 1.4179 3.0577 3.6659
dipole: 4.9798
quadrupole: -223.0990 -192.5439 -200.7676
quadrupole: 40.4310 17.4336 -12.3000
quadrupole: -17.6288 12.9263 4.7026 40.4310 17.4336 -12.3000
hfenergy: -2241.6824322 hartree
pointgroup: C01 [X(C21H18Cl1N5O4S1)]
dipole: -0.2916813 1.7810903 -0.7623346 debye
polarizability: 451.4455117|-27.801151|319.5082289|5.8792439|41.3407343|310.1150618 unknown
InChI: InChI=1S/C21H18ClN5O4S/c1-14(28)20(21(29)24-16-7-5-15(22)6-8-16)26-25-17-9-11-18(12-10-17)32(30,31)27-19-4-2-3-13-23-19/h2-13,20,24,27H,1H3
charge 0 multiplicity 1
50 atoms
Cl 7.092398 2.839245 3.972207
S  -4.846338 -0.769305 0.949187
O  -4.900358 -1.420073 2.441398
O  -5.960608 -1.134678 -0.1664
O  5.197373 -1.395619 -1.346448
O  2.67099 -4.477456 -0.073603
N  -4.832828 1.042546 1.387492
N  3.791302 -0.831043 0.467332
N  1.665544 -1.945544 -0.588091
N  0.644445 -1.951279 -1.38512
N  -4.693149 1.770696 -0.848725
C  -3.123417 -1.079908 0.243795
C  -2.134246 -1.500154 1.151219
C  -2.934076 -0.95663 -1.140529
C  2.924792 -2.328738 -1.261934
C  -0.615989 -1.651723 -0.75786
C  -0.85535 -1.785955 0.637969
C  -1.654609 -1.266028 -1.644516
C  4.096353 -1.45705 -0.723185
C  -5.071323 2.043742 0.435293
C  3.260262 -3.841181 -0.975666
C  4.609269 0.023118 1.254283
C  -5.62557 3.29684 0.828995
C  5.9412 0.363274 0.894636
C  4.046866 0.548298 2.448756
C  4.321415 -4.427756 -1.882178
C  6.692713 1.220721 1.725863
C  4.797474 1.4037 3.278926
C  -5.758297 4.300177 -0.149052
C  6.115601 1.73045 2.904084
C  -4.854987 2.751287 -1.780856
C  -5.370318 4.031496 -1.484729
H  -2.376476 -1.622303 2.211703
H  -3.754623 -0.62633 -1.782005
H  2.87344 -2.196639 -2.360312
H  -5.209381 1.142153 2.339814
H  -0.049251 -2.1371 1.288697
H  -1.436991 -1.207128 -2.715028
H  2.82136 -1.005052 0.77806
H  -5.934275 3.472579 1.86447
H  6.37388 -0.039882 -0.022796
H  3.020335 0.288676 2.733892
H  3.887453 -4.600815 -2.886617
H  5.158993 -3.718657 -2.011159
H  4.675643 -5.38815 -1.477293
H  7.718216 1.486299 1.45345
H  4.36435 1.806378 4.198673
H  -6.17328 5.275703 0.125082
H  -4.555142 2.489053 -2.801665
H  -5.472087 4.783244 -2.271907
