program: Gaussian 09
title: 000281427
version: EM64L-G09RevD.01
frameworkgroup: C1[X(C23H23N5O4S)]
method: RPBEPBE
basis: SDD
operation: Freq
keyword: #p
keyword: freq=noraman
keyword: PBEPBE/SDD
title: #p freq=noraman PBEPBE/SDD
converged: YES YES NO NO
title: Mulliken charges:
elementType: S O O O O N N N N N C C C C C C C C C C C C C C C C C C C C C C C H H H H H H H H H H H H H H H H H H H H H H H
charge: 0.972449 -0.540833 -0.482545 -0.250484 -0.177544 -0.454451 -0.637900 -0.105335 -0.089897 -0.073042 0.529026 0.516254 0.502801 -0.060062 -0.346846 -0.509131 -0.681286 -0.594855 0.152944 -0.232885 -0.143611 0.184491 -0.812453 -0.817382 -0.268547 -0.349626 0.217383 0.287711 -0.765372 -0.323245 -0.146109 -0.317311 -0.191880 0.283370 0.302286 0.232445 0.236548 0.360993 0.294257 0.298700 0.279916 0.267053 0.231718 0.232284 0.222744 0.233740 0.220872 0.234067 0.340578 0.242448 0.292391 0.253273 0.233100 0.242692 0.238390 0.235710
chargesum: 0.00000
title: Mulliken charges with hydrogens summed into heavy atoms:
elementType: S O O O O N N N N N C C C C C C C C C C C C C C C C C C C C C C C
charge: 0.972449 -0.540833 -0.482545 -0.250484 -0.177544 -0.093458 -0.297322 -0.105335 -0.089897 -0.073042 0.529026 0.516254 0.502801 -0.060062 -0.063477 -0.206844 -0.448841 -0.358307 0.152944 0.061372 0.155089 0.184491 -0.125707 -0.128703 0.011369 -0.082573 0.217383 0.287711 0.022739 -0.090146 0.096583 -0.078921 0.043830
polarizability: 4.82530248e+02 -2.30353763e+01 3.44096241e+02 -1.45016734e+01 2.27422925e+01 2.99689535e+02
1716.lowfreq: -4.9532 -1.0177 0.0017 0.0018 0.0019 5.5051 6.3392 14.1630 15.7904
frequency: 5.9748 14.1286 15.7284 17.6229 33.1328 35.2803 37.3510 42.4940 49.1750 56.9173 60.9403 62.6651 83.7529 87.5977 93.4579 118.3331 126.5324 136.9096 155.1259 177.9493 184.1662 194.4516 200.0239 210.2650 220.7276 225.0868 248.7605 252.1344 274.7282 277.0399 293.9745 310.8786 321.0284 351.3793 373.6306 396.4723 407.2966 409.1508 420.9792 436.0109 452.5473 458.2915 485.7955 506.9524 510.7451 514.3019 522.5337 528.2384 540.7416 566.1498 587.8994 590.8174 604.9176 615.9012 623.0048 655.1352 684.3989 705.6520 709.2267 726.6591 738.7848 760.3273 774.7050 796.9317 810.9833 817.5580 834.4384 847.0344 853.0387 868.0774 869.7547 870.2058 886.3999 900.6139 929.2012 944.7742 949.5830 950.1967 954.9095 959.5018 969.0025 972.2547 986.3738 986.4181 987.3440 993.7524 1019.5770 1021.5267 1030.6954 1039.4370 1042.1931 1047.6411 1052.1105 1053.0258 1095.7212 1107.7311 1140.4322 1153.5189 1159.6753 1166.1089 1177.1081 1183.2803 1191.0587 1207.1934 1228.9577 1274.0568 1286.5659 1292.8535 1309.0196 1319.5170 1322.6284 1348.4429 1375.6309 1390.3089 1393.4558 1394.5048 1397.6688 1399.5376 1418.7415 1426.6868 1430.5141 1441.9604 1445.6519 1453.2364 1453.7760 1455.5294 1469.4107 1470.6707 1480.8111 1490.0154 1534.8387 1557.8871 1577.6003 1580.8130 1592.1098 1614.8986 1617.9938 1624.1573 1643.0023 2977.7619 2978.9193 2980.0560 3008.5780 3057.5286 3058.5358 3064.6878 3083.5802 3085.5944 3110.2552 3117.8246 3124.3993 3134.7646 3141.0229 3155.9670 3159.0877 3165.9864 3174.9276 3176.4564 3180.9828 3187.5776 3376.1382 3484.1142
redmass: 6.3655 4.2805 5.1717 5.9481 2.2456 1.6556 4.3600 4.2284 5.7828 4.6083 1.2897 2.6553 6.7933 6.2072 5.8570 6.8162 7.9055 6.7061 1.0421 6.7064 5.7597 3.4809 4.8986 7.2867 8.3010 3.0234 7.4517 3.7427 4.3209 4.9192 4.9606 8.9364 8.3322 8.8272 6.3243 4.6689 3.5856 3.0200 6.7898 6.6046 1.5611 3.7643 4.3782 4.9576 3.6909 3.2784 3.0411 4.3175 3.6150 4.1144 5.3955 4.7312 6.4454 6.7627 6.2195 5.8243 5.4508 1.9908 3.0730 3.7480 1.9621 4.7384 2.1075 3.8985 5.0522 1.4706 1.3327 2.5687 5.2574 1.3379 1.4713 1.9827 1.3435 4.1368 1.3872 2.5502 2.8682 2.2472 2.1202 7.5087 1.4084 3.6426 1.6520 2.9373 2.0842 2.2980 1.6868 1.7172 2.7338 2.2764 2.3596 1.5367 3.0770 1.6034 1.6033 1.2932 2.1751 1.9556 1.7609 1.0720 1.4251 1.4342 1.9309 1.4126 1.8176 1.4779 1.2752 1.3340 2.1093 3.5173 3.9543 2.0567 1.2363 5.4448 8.9963 3.5184 1.2442 1.3032 2.1919 5.7130 2.7063 1.1528 1.9936 2.2631 1.1057 2.1639 1.0459 1.0460 1.1336 1.3701 2.0268 5.7758 6.3168 5.9114 7.5909 5.2141 6.6630 6.9135 8.3262 1.0371 1.0370 1.0374 1.0829 1.0977 1.0976 1.0954 1.0992 1.0992 1.0916 1.0920 1.1011 1.0888 1.0891 1.0888 1.0954 1.0897 1.0964 1.0929 1.1006 1.0967 1.0769 1.0775
irintensity: 0.4414 0.1337 0.2221 0.2226 1.3184 0.3029 4.2092 1.5362 1.3746 0.0839 1.1318 4.6868 0.3305 0.8380 2.8509 0.3248 2.0049 0.3495 0.1375 11.2224 11.6491 4.8505 7.2340 0.3084 1.2117 0.1092 7.9078 4.3691 1.3106 5.0983 5.1953 12.6286 22.2582 10.6890 5.6800 6.8235 7.4174 7.3686 32.9492 72.8005 55.9252 25.2882 41.2206 9.0362 16.5030 65.1663 2.1699 11.2932 13.9789 9.0535 15.9310 34.4523 5.8647 1.2832 4.4088 8.3336 5.0660 11.1231 194.2577 1.4223 61.8519 1.9474 60.3006 32.9252 103.8073 40.0679 17.3489 62.4920 31.8655 0.4234 60.8133 22.4137 3.0649 12.0410 18.3560 19.2640 17.2018 25.5402 0.4199 25.0651 2.1689 12.4672 0.1353 1.6235 4.2092 0.7257 0.8696 2.9835 39.9338 4.3840 30.2594 0.3920 8.4385 27.4398 6.0839 2.6815 182.1319 120.5497 41.9988 6.0657 17.1663 29.4008 20.3509 13.1427 16.9866 16.5609 3.9926 4.5053 24.4415 71.5480 1.5200 17.2323 106.7386 3.5782 16.5934 8.6495 21.8297 17.5654 83.5614 12.3079 33.0149 19.2481 68.2851 139.5990 13.9449 20.0414 18.8726 6.0321 26.8750 75.6552 455.5291 13.0069 38.1343 108.1442 2.1152 49.8665 135.6608 165.0592 112.3909 36.3469 33.6874 5.9745 12.9521 16.2558 20.5168 4.6574 15.1956 20.2428 20.6631 15.6500 7.2950 14.5413 2.3669 3.4817 17.7200 2.4335 0.2781 2.2632 19.8475 5.7153 158.1627 43.8313
temp: 298.150 k
press: 1.00000 atm
elementType: 16 8 8 8 8 7 7 7 7 7 6 6 6 6 6 6 6 6 6 6 6 6 6 6 6 6 6 6 6 6 6 6 6 1 1 1 1 1 1 1 1 1 1 1 1 1 1 1 1 1 1 1 1 1 1 1
symmnumber: 1
zpe: 1104198.4 jmol-1
zpe.correction: 0.420567 hartree
zpe.thermalcorrener: 0.453675 hartree
zpe.thermalcorrenthalpy: 0.454619 hartree
zpe.thermalcorrgfe: 0.348387 hartree
zpe.sumelectzpe: -1860.395400 hartree
zpe.sumelectthermal: -1860.362292 hartree
zpe.sumelectthermalent: -1860.361348 hartree
zpe.sumelectthermalfe: -1860.467580 hartree
dipole: 0.1952 5.4565 -3.3336
dipole: 6.3972
quadrupole: -202.2955 -183.9546 -201.7145
quadrupole: -22.8775 20.5267 14.6382
quadrupole: -6.3073 12.0336 -5.7263 -22.8775 20.5267 14.6382
hfenergy: -1860.8159668 hartree
pointgroup: C01 [X(C23H23N5O4S1)]
dipole: 0.5449048 -2.1468624 1.1952105 debye
polarizability: 474.0665065|42.7783635|350.9081974|-16.2098798|18.7090156|301.34132 unknown
InChI: InChI=1S/C23H23N5O4S/c1-15-12-16(2)14-19(13-15)25-23(30)22(17(3)29)27-26-18-7-9-20(10-8-18)33(31,32)28-21-6-4-5-11-24-21/h4-14,22,25,28H,1-3H3
charge 0 multiplicity 1
56 atoms
S  -4.968185 0.209667 -0.793472
O  -5.035711 0.077636 -2.41539
O  -6.094256 1.032357 0.027902
O  5.043564 2.126876 0.805438
O  2.433275 4.226208 -1.696171
N  3.675964 0.774183 -0.570546
N  -4.917898 -1.596964 -0.323496
N  1.499269 2.169683 -0.080921
N  0.485802 2.476043 0.666172
N  -4.792715 -1.18645 1.993308
C  4.526752 -0.313306 -0.920968
C  4.744687 -2.427853 -2.157807
C  6.652215 -1.528853 -0.866449
C  -3.254068 0.852927 -0.333581
C  2.744128 2.850326 0.330804
C  5.86485 -0.416798 -0.473707
C  3.971918 -1.317784 -1.759897
C  6.087202 -2.520191 -1.701775
C  3.949172 1.865888 0.221858
C  -2.283957 0.855534 -1.352247
C  -3.054086 1.360966 0.958493
C  -0.764292 1.886522 0.261217
C  4.159076 -3.505724 -3.054046
C  8.089608 -1.6395 -0.386702
C  -1.014594 1.379792 -1.044221
C  -1.78383 1.899028 1.24802
C  3.032188 4.080556 -0.606617
C  -5.160055 -2.033891 0.986389
C  4.067613 5.044537 -0.066185
C  -5.707072 -3.328645 1.226363
C  -5.843968 -3.754883 2.560645
C  -4.95896 -1.614231 3.276196
C  -5.467534 -2.886632 3.614818
H  2.697438 3.220686 1.373491
H  6.279382 0.362438 0.170363
H  2.932813 -1.22752 -2.102807
H  6.698045 -3.379647 -2.006048
H  2.704938 0.759708 -0.92095
H  -2.533511 0.484478 -2.351382
H  -3.858523 1.321161 1.696923
H  -0.223935 1.429398 -1.798548
H  -1.558918 2.325346 2.230127
H  4.163876 -4.490544 -2.550153
H  4.746235 -3.614338 -3.985055
H  3.117264 -3.27824 -3.33797
H  8.141199 -1.663226 0.717849
H  8.575535 -2.553583 -0.768762
H  8.689447 -0.771685 -0.718945
H  -5.284854 -2.139307 -1.117376
H  3.620487 5.635867 0.756858
H  4.924608 4.493065 0.361233
H  4.395904 5.731484 -0.861276
H  -6.007267 -3.972774 0.393606
H  -6.253482 -4.747463 2.775523
H  -4.668376 -0.900505 4.05525
H  -5.57291 -3.18012 4.662629
