program: Gaussian 09
title: 000281343
version: EM64L-G09RevD.01
frameworkgroup: C1[X(C10H9N7O2S)]
method: RPBEPBE
basis: SDD
operation: Freq
keyword: #p
keyword: freq=noraman
keyword: PBEPBE/SDD
title: #p freq=noraman PBEPBE/SDD
converged: NO YES NO NO
title: Mulliken charges:
elementType: S O O N N N N N N N C C C C C C C C C C H H H H H H H H H
charge: 0.871799 -0.510661 -0.571097 -0.395931 -0.068194 -0.087083 -0.616276 -0.637632 0.030496 0.029106 -0.017691 -0.205218 -0.224661 0.157495 -0.254228 -0.308414 0.365303 -0.146702 -0.123625 -0.122163 0.284207 0.295850 0.287888 0.268948 0.321281 0.350041 0.397839 0.321468 0.307855
chargesum: 0.00000
title: Mulliken charges with hydrogens summed into heavy atoms:
elementType: S O O N N N N N N N C C C C C C C C C C
charge: 0.871799 -0.510661 -0.571097 -0.395931 -0.068194 -0.087083 0.055046 0.081676 0.030496 0.029106 -0.017691 0.078988 0.071188 0.157495 0.033660 -0.039466 0.365303 0.161153 -0.123625 -0.122163
polarizability: 3.27526235e+02 4.75624759e+00 1.55159805e+02 -2.88463361e+00 4.35725912e+00 1.49353566e+02
1716.lowfreq: -9.4569 -4.5131 -1.2470 0.0013 0.0015 0.0019 12.8018 24.5815 32.3195
frequency: 12.4159 24.5334 32.2932 41.9532 50.9491 70.5304 84.8917 109.1778 123.5904 141.0973 185.3292 195.6630 205.1812 249.6601 259.5299 267.0127 277.4293 331.0795 339.9957 352.7370 363.3209 382.2192 407.2474 422.9948 427.4506 453.2490 481.8359 496.8745 532.9109 545.8450 556.5985 563.7952 598.0765 615.5438 618.7617 668.8377 677.3270 735.7671 764.5701 800.0350 811.0664 852.5468 869.0811 897.2619 912.2390 942.6634 977.7910 987.0199 995.7013 996.7249 1011.4458 1050.7969 1063.1383 1105.0981 1109.3183 1149.8212 1185.0186 1225.8528 1284.5989 1284.7925 1380.3197 1397.5154 1406.5966 1457.9691 1487.8179 1510.5029 1581.0547 1595.1877 1608.3155 1641.7711 2210.4130 2211.5482 2969.2810 3158.3554 3159.6529 3176.4899 3178.6172 3286.1012 3538.8089 3626.1021 3687.8583
redmass: 9.7171 7.3034 4.7664 6.4327 7.4614 8.4445 6.7300 12.2934 7.2694 8.9306 9.1302 7.8450 9.7079 7.2253 8.7164 8.1376 5.9162 5.1061 2.7480 6.0079 8.1027 2.2684 2.7569 5.5234 4.4076 2.8177 2.0544 3.5495 2.1397 1.5932 3.5635 12.3767 8.3061 5.3289 6.3710 7.2345 9.0419 3.7936 5.9566 4.0859 1.4299 1.2496 1.5359 8.6563 17.6462 5.3142 5.1837 1.4001 4.3539 1.3819 3.7024 2.5680 1.4582 1.3334 1.5635 1.5941 1.6515 1.5468 1.2647 1.3570 6.2403 10.5286 4.2944 2.2475 3.9352 2.8440 6.6643 7.1509 1.2750 1.2975 12.6052 12.5937 1.0808 1.0891 1.0891 1.0966 1.0978 1.0649 1.0453 1.0887 1.1042
irintensity: 3.1803 1.0403 1.1095 2.6048 0.1780 7.4340 1.5417 2.0474 1.6289 4.0438 11.4911 6.4720 4.6561 14.2786 8.1482 15.2839 1.0322 5.4941 76.4901 3.3422 1.1631 33.4606 16.4035 52.8921 43.4698 33.7558 145.4832 43.2491 192.9707 103.2764 47.0772 1.9667 63.1622 24.2969 4.6367 9.7828 16.0539 4.2533 71.8975 38.4462 159.9367 2.8839 50.2550 11.9734 101.2597 4.0300 16.4364 0.4947 12.6010 0.1927 19.7213 24.1957 10.7248 14.9533 29.6599 33.3379 19.8088 7.1847 3.0346 2.2642 95.7030 13.8913 34.9063 8.9761 154.6028 471.1578 24.8889 20.6524 221.1876 499.6026 2.1447 1.0657 8.6445 2.4906 2.7017 1.4027 0.7854 173.6323 75.4292 83.6105 39.4348
temp: 298.150 k
press: 1.00000 atm
elementType: 16 8 8 7 7 7 7 7 7 7 6 6 6 6 6 6 6 6 6 6 1 1 1 1 1 1 1 1 1
symmnumber: 1
zpe: 505126.6 jmol-1
zpe.correction: 0.192393 hartree
zpe.thermalcorrener: 0.212689 hartree
zpe.thermalcorrenthalpy: 0.213633 hartree
zpe.thermalcorrgfe: 0.140028 hartree
zpe.sumelectzpe: -1316.539839 hartree
zpe.sumelectthermal: -1316.519542 hartree
zpe.sumelectthermalent: -1316.518598 hartree
zpe.sumelectthermalfe: -1316.592203 hartree
dipole: 6.3340 4.2561 -1.5308
dipole: 7.7831
quadrupole: -123.6560 -131.3300 -121.5865
quadrupole: 38.2170 20.9878 5.5577
quadrupole: 1.8682 -5.8059 3.9377 38.2170 20.9878 5.5577
hfenergy: -1316.7322312 hartree
pointgroup: C01 [X(C10H9N7O2S1)]
dipole: 2.4194247 1.7100529 -0.7737513 debye
polarizability: 326.216803|7.8560756|155.4476614|-14.2930718|3.7592544|150.3751418 unknown
InChI: InChI=1S/C10H9N7O2S/c11-5-8(6-12)16-15-7-1-3-9(4-2-7)20(18,19)17-10(13)14/h1-4,8H,13-14H2
charge 0 multiplicity 1
29 atoms
S  3.446649 -0.878676 -0.121392
O  3.882923 -1.991867 -1.224884
O  3.839832 -1.127272 1.469971
N  3.891177 0.827043 -0.655463
N  -2.611036 -0.468093 -0.517926
N  -3.277411 0.010056 0.485177
N  5.562229 2.425767 -0.770887
N  5.774813 0.783634 0.908818
N  -6.050551 -1.508385 1.923869
N  -5.611891 2.552547 0.130413
C  1.569645 -0.718473 -0.204569
C  0.887289 -0.229233 0.925346
C  0.938028 -1.133783 -1.386104
C  -1.185611 -0.527317 -0.329627
C  -0.513622 -0.131523 0.861988
C  -0.46756 -1.032909 -1.443272
C  5.064708 1.29382 -0.151017
C  -4.778324 0.016258 0.140093
C  -5.49355 -0.811619 1.134284
C  -5.254197 1.416305 0.149331
H  1.44328 0.042566 1.827964
H  1.528364 -1.535477 -2.215258
H  -1.095875 0.241713 1.70939
H  -1.025605 -1.335785 -2.334289
H  6.146939 3.087734 -0.264224
H  5.100402 2.727952 -1.626499
H  5.342421 0.018072 1.454981
H  6.747168 1.044014 1.059058
H  -4.925936 -0.414372 -0.873573
