program: Gaussian 09
title: 000281344
version: EM64L-G09RevD.01
frameworkgroup: C1[X(C12H13N3O5S)]
method: RPBEPBE
basis: SDD
operation: Freq
keyword: #p
keyword: freq=noraman
keyword: PBEPBE/SDD
title: #p freq=noraman PBEPBE/SDD
converged: YES YES NO NO
title: Mulliken charges:
elementType: S O O O O O N N N C C C C C C C C C C C C H H H H H H H H H H H H H
charge: 0.950811 -0.176903 -0.165796 -0.183312 -0.533844 -0.532496 -0.093873 -0.095999 -0.718276 -0.053629 -0.506304 -0.306966 0.218187 0.235794 -0.773909 0.192894 -0.040901 -0.321828 -0.262061 -0.213701 -0.211608 0.248690 0.266986 0.240982 0.252996 0.238047 0.279335 0.254425 0.273761 0.285762 0.290532 0.286105 0.338346 0.337755
chargesum: 0.00000
title: Mulliken charges with hydrogens summed into heavy atoms:
elementType: S O O O O O N N N C C C C C C C C C C C C
charge: 0.950811 -0.176903 -0.165796 -0.183312 -0.533844 -0.532496 -0.093873 -0.095999 -0.042175 -0.053629 0.009373 0.187012 0.218187 0.235794 -0.002101 0.192894 -0.040901 -0.048067 0.023700 0.076831 0.074497
polarizability: 3.39608399e+02 -1.04143045e+01 1.54635556e+02 -3.93097948e+00 1.76922558e+01 1.52688486e+02
1716.lowfreq: -2.6363 -0.2408 -0.0017 -0.0012 -0.0010 6.9888 15.9676 29.1816 31.6930
frequency: 14.7853 29.1651 31.6816 37.5023 60.0178 77.8161 96.2377 108.0746 111.3044 140.3128 146.6133 164.2894 183.9435 205.6280 218.9527 228.9688 262.1324 270.2396 280.4213 309.6708 315.1006 322.3264 356.3587 393.8697 416.4756 430.4480 461.4163 473.7277 494.2108 519.5919 545.6449 566.7871 587.8149 615.1327 620.5112 658.0316 669.0143 731.2471 746.0621 796.7017 802.6304 808.6297 843.9334 852.2922 870.1759 896.2944 909.4878 924.3723 964.0990 982.3785 987.1597 991.7570 997.6867 1007.6380 1020.1874 1042.9476 1046.2288 1070.3706 1100.3538 1108.7208 1114.0754 1152.9453 1168.4466 1193.4516 1198.8756 1219.3147 1283.5151 1300.1695 1347.7839 1366.2454 1378.5453 1394.6905 1406.6716 1444.7269 1446.1366 1456.7557 1466.8363 1482.4323 1534.3981 1579.7989 1596.1225 1617.4252 1711.1501 2993.7715 3025.5224 3050.4142 3082.7257 3092.5756 3125.1957 3129.9941 3155.6652 3159.7637 3176.3319 3178.4443 3362.0932 3528.5761
redmass: 6.6748 4.8616 5.2501 5.0222 5.7520 6.3413 7.7121 1.6528 4.3380 5.5051 6.7038 7.0977 1.0909 3.6835 8.1578 4.7339 2.5368 2.8510 6.1500 7.1332 5.1183 6.7312 5.7565 4.7232 3.6220 10.6578 7.4619 3.9869 4.6737 3.7202 3.2471 4.8048 6.0372 7.1232 4.1674 5.4054 4.2872 4.3459 5.0424 2.7663 2.5553 3.1152 4.3435 1.2496 1.5602 3.1529 3.9662 2.8957 2.1910 2.1826 1.4230 4.5892 1.3762 2.8894 2.7762 5.8530 2.7193 1.4772 3.3770 1.4835 2.0525 1.5679 1.6282 1.5972 1.9607 1.8810 1.2659 1.3814 1.3012 1.2465 5.5286 10.3222 4.1997 1.0743 1.0666 2.2368 1.0866 1.0889 1.0854 6.4902 7.5576 8.8087 12.8756 1.0357 1.0598 1.0610 1.0961 1.1042 1.1017 1.1094 1.0892 1.0890 1.0959 1.0977 1.0415 1.1001
irintensity: 0.6136 1.3789 1.5677 1.9114 1.1908 5.4411 2.1002 31.9235 7.8568 0.2044 1.8253 1.4380 1.7820 5.1185 2.9995 11.6564 3.3162 2.7424 3.8601 21.1958 1.3263 1.0575 0.1164 0.9144 2.5533 77.6832 3.7076 126.4476 46.8206 18.3702 44.0278 0.5981 75.3292 0.7756 11.9524 8.2833 4.2552 2.4808 3.3431 25.9592 77.6630 184.2957 2.9981 0.8719 61.6405 12.4696 57.1440 60.3478 35.3207 26.7002 6.3578 6.9642 0.4681 17.5865 11.9165 385.5185 17.4625 30.1279 4.8533 3.9841 9.5731 22.0039 46.9594 10.9767 22.6665 60.0044 1.7806 3.7307 3.2433 53.0371 7.0649 12.4943 18.9694 26.5884 39.0783 11.2496 13.2364 12.5913 20.6302 6.0990 1.7760 173.5623 196.0655 1.3744 8.9548 36.2760 4.6551 11.0515 11.7287 13.1107 2.4201 1.6892 0.7492 0.5833 34.0911 26.3508
temp: 298.150 k
press: 1.00000 atm
elementType: 16 8 8 8 8 8 7 7 7 6 6 6 6 6 6 6 6 6 6 6 6 1 1 1 1 1 1 1 1 1 1 1 1 1
symmnumber: 1
zpe: 633106.6 jmol-1
zpe.correction: 0.241138 hartree
zpe.thermalcorrener: 0.262633 hartree
zpe.thermalcorrenthalpy: 0.263577 hartree
zpe.thermalcorrgfe: 0.187965 hartree
zpe.sumelectzpe: -1401.724231 hartree
zpe.sumelectthermal: -1401.702735 hartree
zpe.sumelectthermalent: -1401.701791 hartree
zpe.sumelectthermalfe: -1401.777403 hartree
dipole: 0.9501 2.8092 -7.5346
dipole: 8.0972
quadrupole: -139.9729 -129.1488 -133.4055
quadrupole: -19.3219 -9.8492 5.5656
quadrupole: -5.7972 5.0270 0.7702 -19.3219 -9.8492 5.5656
hfenergy: -1401.9653685 hartree
pointgroup: C01 [X(C12H13N3O5S1)]
dipole: -0.3944243 -3.0162917 -0.9459868 debye
polarizability: 335.1934246|-11.0835237|136.912008|27.4968503|2.4280655|174.8270087 unknown
InChI: InChI=1S/C12H13N3O5S/c1-8(16)12(6-7-20-11(12)17)15-14-9-2-4-10(5-3-9)21(13,18)19/h2-5H,6-7,13H2,1H3
charge 0 multiplicity 1
34 atoms
S  5.32188 0.195682 0.224052
O  -4.320721 1.920484 -1.400244
O  -2.734779 2.467156 0.203956
O  -4.638351 -0.367238 0.899487
O  5.821985 0.56447 -1.280878
O  5.78854 1.001426 1.559166
N  -1.395116 0.020183 -0.858447
N  -0.769447 0.151127 0.274578
N  5.753236 -1.574834 0.495753
C  -2.866499 0.107103 -0.696914
C  -3.572259 -0.284137 -2.024441
C  -4.778865 0.675855 -2.089517
C  -3.266901 1.631855 -0.531115
C  -3.505877 -0.708555 0.475268
C  -2.787508 -1.945165 0.975525
C  0.668354 0.150136 0.167246
C  3.434116 0.166934 0.205685
C  1.352209 0.355758 1.39189
C  1.385763 -0.028895 -1.048627
C  2.762524 0.368283 1.420667
C  2.792043 -0.023448 -1.031966
H  -3.882643 -1.341748 -2.062555
H  -2.860485 -0.095167 -2.846716
H  -5.061931 0.971134 -3.110412
H  -5.653659 0.298884 -1.535315
H  -2.288016 -2.491888 0.155958
H  -1.997388 -1.63806 1.684624
H  -3.506871 -2.596396 1.495897
H  0.762766 0.515079 2.299699
H  0.828767 -0.164942 -1.97992
H  3.321026 0.55148 2.343534
H  3.3819 -0.13662 -1.94711
H  6.312738 -1.893289 -0.313615
H  6.261567 -1.646342 1.393506
