program: Gaussian 09
title: 000281375
version: EM64L-G09RevD.01
frameworkgroup: C1[X(C20H18N4O4S)]
method: RPBEPBE
basis: SDD
operation: Freq
keyword: #p
keyword: freq=noraman
keyword: PBEPBE/SDD
title: #p freq=noraman PBEPBE/SDD
converged: YES YES NO NO
title: Mulliken charges:
elementType: S O O O O N N N N C C C C C C C C C C C C C C C C C C C C H H H H H H H H H H H H H H H H H H
charge: 0.952352 -0.245820 -0.179717 -0.533969 -0.533676 -0.458532 -0.115121 -0.085518 -0.718159 0.141243 0.354967 0.433330 -0.333261 -0.377691 -0.334178 -0.463371 -0.424565 0.145266 -0.236175 -0.274546 -0.243197 -0.043405 0.218306 0.185532 -0.211026 -0.215462 -0.323767 -0.259014 -0.764583 0.377154 0.283657 0.301205 0.208087 0.240379 0.240866 0.230197 0.233199 0.233240 0.290512 0.286692 0.269229 0.277072 0.241950 0.296943 0.253522 0.339967 0.339886
chargesum: 0.00000
title: Mulliken charges with hydrogens summed into heavy atoms:
elementType: S O O O O N N N N C C C C C C C C C C C C C C C C C C C C
charge: 0.952352 -0.245820 -0.179717 -0.533969 -0.533676 -0.081378 -0.115121 -0.085518 -0.038307 0.141243 0.354967 0.433330 -0.049604 -0.076486 -0.126091 -0.222993 -0.183699 0.145266 -0.005977 -0.041347 -0.009956 -0.043405 0.218306 0.185532 0.079486 0.071229 -0.054538 0.018057 0.027833
polarizability: 4.57387682e+02 -2.57781766e+01 3.48626836e+02 6.83908429e+00 -2.63862553e+01 1.77828888e+02
1716.lowfreq: -6.1803 -2.0534 0.0007 0.0018 0.0020 1.2995 8.3619 15.2741 20.3919
frequency: 7.2383 15.2142 20.1347 33.8196 35.1697 41.9483 49.8639 61.8492 75.8385 87.0995 113.5231 119.1560 127.2068 139.5284 148.1651 166.5965 177.3021 190.9473 199.1929 218.1932 258.9371 267.6077 282.9020 291.3083 295.9405 317.9735 333.5310 367.2239 391.2356 401.5669 413.2133 417.5325 421.0672 439.2039 468.7032 472.0129 478.4611 502.9956 513.9943 518.4896 547.8025 563.7089 575.0786 602.0161 615.4761 631.1231 648.2227 680.6760 692.7952 737.3587 738.4615 778.6592 782.4913 784.6631 791.3271 801.9045 804.4002 810.7085 842.0717 846.7520 847.6042 859.2718 871.1650 878.2060 909.0741 928.0519 929.1946 949.6714 957.0882 980.0397 987.6296 987.8677 994.1585 995.1747 1020.4517 1028.2248 1037.3088 1047.7827 1057.0913 1070.4747 1090.7129 1111.1583 1139.3240 1153.9971 1154.8841 1164.2885 1183.3898 1189.3543 1193.5237 1212.6103 1236.4210 1261.5566 1277.4077 1284.8592 1290.5459 1370.2474 1376.0930 1392.2842 1396.1250 1408.8233 1420.3459 1431.6397 1440.8202 1445.6530 1453.8299 1455.0058 1457.2390 1501.2876 1534.0013 1539.9144 1579.3861 1589.5259 1594.3045 1597.4037 1624.7526 1635.7311 1642.8167 2980.0889 3001.2356 3064.9139 3115.9687 3124.6885 3126.2241 3130.6473 3144.3378 3154.9132 3155.6060 3159.1734 3164.7531 3173.0376 3177.6058 3191.5625 3370.6069 3370.8964 3538.6299
redmass: 5.3849 7.6045 6.4905 6.4171 5.0261 5.2550 5.1292 5.6825 5.3023 6.3249 1.5471 5.8207 5.2269 7.4452 1.0573 5.5390 4.0793 6.5375 6.3607 7.4259 6.6390 2.4728 5.3079 4.8361 9.7334 9.4287 7.0706 6.5196 4.8930 5.2421 3.1725 5.4027 3.1484 7.0750 3.8706 3.3513 4.6278 5.6116 5.7430 4.5476 3.5075 3.6410 3.7149 6.2991 6.8514 5.9445 3.3931 5.5653 5.6436 1.4074 3.6163 4.5280 5.1375 1.9565 1.9548 1.4202 6.4529 3.3262 2.2178 1.9037 1.2789 3.4209 1.9677 1.6626 3.9637 1.4285 4.0772 2.5200 1.3999 1.4510 1.5350 1.3714 1.3955 2.8289 2.2545 3.0047 3.3782 2.5230 2.5625 1.4929 2.2427 1.3038 2.0988 1.5095 1.8922 1.5106 1.1155 1.6522 1.4678 1.8155 1.8839 1.5261 1.7606 1.3489 2.0192 2.3439 1.2445 6.2963 4.2284 2.8135 5.9444 8.3201 1.0680 2.4642 1.1132 2.2137 2.2276 2.6189 1.0854 2.4882 6.5448 7.0288 7.4012 5.3351 7.0178 5.4699 8.3293 1.0377 1.0823 1.0949 1.0865 1.1012 1.0881 1.0872 1.0940 1.0886 1.0963 1.0888 1.1003 1.0966 1.0977 1.0947 1.0586 1.0584 1.1005
irintensity: 0.0649 0.5975 0.9476 1.1534 0.8722 1.4158 0.2933 6.8972 0.8306 1.2256 35.9806 5.1750 1.3246 1.0877 0.1903 1.7440 2.8596 9.8167 4.0292 7.2796 4.7959 3.6600 3.3742 3.1919 7.3533 10.3480 8.9011 12.4063 2.3152 6.0015 3.7560 27.7424 9.7941 27.1041 111.4858 4.7503 90.0795 19.8646 0.8960 28.4171 60.5074 3.7001 14.0409 12.8075 1.7357 1.6060 0.3825 11.3687 1.2505 2.4760 0.8652 10.4079 10.0147 82.5727 75.0224 13.8407 148.8439 37.5086 49.9377 98.8263 3.5198 13.1246 34.6789 6.9248 58.1793 3.4933 15.7351 3.2921 1.6280 4.4942 2.1969 3.0936 3.5673 0.2790 9.1421 36.7140 10.3573 23.4103 17.8833 28.8415 6.3207 1.3372 209.3516 20.0520 108.8924 20.1808 1.1290 7.2486 9.5450 19.2167 4.6731 16.7813 1.4308 1.0791 6.2243 19.9936 104.6960 3.2330 26.0323 25.9227 34.2687 0.3699 26.9878 0.0977 26.1277 1.7024 15.4928 279.2123 20.9929 390.5593 5.7000 1.0814 1.8384 6.3396 276.7598 5.9418 105.3303 7.7957 11.8652 6.9874 11.0280 5.7522 0.8734 1.9879 29.2461 1.7807 37.9621 2.0802 22.3527 0.2074 1.8445 2.6534 165.2570 31.0959 28.2052
temp: 298.150 k
press: 1.00000 atm
elementType: 16 8 8 8 8 7 7 7 7 6 6 6 6 6 6 6 6 6 6 6 6 6 6 6 6 6 6 6 6 1 1 1 1 1 1 1 1 1 1 1 1 1 1 1 1 1 1
symmnumber: 1
zpe: 905987.4 jmol-1
zpe.correction: 0.345072 hartree
zpe.thermalcorrener: 0.372721 hartree
zpe.thermalcorrenthalpy: 0.373665 hartree
zpe.thermalcorrgfe: 0.281972 hartree
zpe.sumelectzpe: -1688.633136 hartree
zpe.sumelectthermal: -1688.605488 hartree
zpe.sumelectthermalent: -1688.604543 hartree
zpe.sumelectthermalfe: -1688.696236 hartree
dipole: 0.3924 1.5198 0.6575
dipole: 1.7018
quadrupole: -166.5383 -169.2428 -184.4898
quadrupole: 21.2778 10.2110 -10.7887
quadrupole: 6.8853 4.1808 -11.0661 21.2778 10.2110 -10.7887
hfenergy: -1688.9782083 hartree
pointgroup: C01 [X(C20H18N4O4S1)]
dipole: 0.3077893 0.5857952 0.1018301 debye
polarizability: 437.7383965|-54.8365519|347.9049819|-23.0785878|-55.5290506|198.200027 unknown
InChI: InChI=1S/C20H18N4O4S/c1-13(25)19(24-23-15-9-11-16(12-10-15)29(21,27)28)20(26)22-18-8-4-6-14-5-2-3-7-17(14)18/h2-12,19,22H,21H2,1H3
charge 0 multiplicity 1
47 atoms
S  5.538794 -2.570569 -0.488238
O  -3.194958 2.910011 -1.292474
O  0.223255 3.690122 1.013336
O  4.959798 -3.628282 0.606311
O  6.109003 -2.999448 -1.951745
N  -2.304846 0.946378 -0.314755
N  0.174707 1.583168 -0.770968
N  1.267444 1.658818 -1.460528
N  6.879308 -1.63304 0.346422
C  -3.237845 -1.187922 0.462624
C  -3.45248 0.160404 -0.02893
C  -4.400377 -1.988896 0.792345
C  -0.758612 2.700705 -1.023436
C  -4.75373 0.65969 -0.201644
C  -1.93878 -1.776214 0.630742
C  -5.715112 -1.445569 0.61504
C  -4.214759 -3.322444 1.286953
C  -2.227786 2.192872 -0.897662
C  -5.880204 -0.151272 0.122254
C  -1.790816 -3.080598 1.110437
C  -2.938393 -3.862632 1.447174
C  4.209904 -1.259518 -0.760284
C  -0.517651 3.858704 0.018736
C  2.23279 0.631086 -1.169855
C  4.220394 -0.551884 -1.97268
C  3.261224 -1.064928 0.25983
C  3.217662 0.4200 -2.167856
C  2.256635 -0.103019 0.048659
C  -1.224032 5.156502 -0.308865
H  -1.372244 0.562509 -0.097777
H  -0.629329 3.137585 -2.033531
H  -4.89126 1.671489 -0.587034
H  -1.028591 -1.223309 0.369818
H  -6.583449 -2.063929 0.86916
H  -5.10315 -3.915235 1.535092
H  -6.884533 0.261963 -0.018602
H  -0.789469 -3.510098 1.22294
H  -2.81009 -4.882983 1.823451
H  4.973995 -0.766961 -2.736266
H  3.307384 -1.658729 1.17817
H  3.175362 1.016279 -3.084222
H  1.50773 0.111027 0.817122
H  -0.693813 5.658084 -1.142333
H  -2.255135 4.962571 -0.654629
H  -1.216528 5.821545 0.568407
H  7.028667 -2.042249 1.283456
H  7.719517 -1.660481 -0.254464
