program: Gaussian 09
title: 000281350
version: EM64L-G09RevD.01
frameworkgroup: C1[X(C15H15N5O5S2)]
method: RPBEPBE
basis: SDD
operation: Freq
keyword: #p
keyword: freq=noraman
keyword: PBEPBE/SDD
title: #p freq=noraman PBEPBE/SDD
converged: YES YES NO NO
title: Mulliken charges:
elementType: S S O O O O O N N N N N C C C C C C C C C C C C C C C H H H H H H H H H H H H H H H
charge: 0.945469 0.235097 -0.181825 -0.200645 -0.185539 -0.522767 -0.469466 -0.097409 -0.074432 -0.516992 -0.084157 -0.051180 -0.003066 -0.498595 -0.301932 0.213097 0.176229 -0.775927 0.171024 -0.057685 -0.294995 -0.317660 -0.147353 -0.239865 -0.070524 -0.043282 -0.706955 0.256903 0.286185 0.246673 0.232994 0.255537 0.285928 0.257938 0.286796 0.277759 0.317394 0.299852 0.337755 0.245865 0.266220 0.247536
chargesum: 0.00000
title: Mulliken charges with hydrogens summed into heavy atoms:
elementType: S S O O O O O N N N N N C C C C C C C C C C C C C C C
charge: 0.945469 0.235097 -0.181825 -0.200645 -0.185539 -0.522767 -0.469466 -0.097409 -0.074432 -0.179238 -0.084157 -0.051180 -0.003066 0.044493 0.177734 0.213097 0.176229 0.023476 0.171024 -0.057685 -0.008199 -0.039901 0.170041 0.059987 -0.070524 -0.043282 0.052666
polarizability: 4.20044970e+02 -1.16012769e+01 2.87915676e+02 -1.64322993e+01 -1.98489475e+01 1.81677723e+02
1716.lowfreq: -6.1831 -2.5014 -2.3106 -0.0010 0.0007 0.0010 8.5520 14.3449 28.6440
frequency: 7.6406 13.9167 28.6425 33.3118 39.2840 52.5510 56.0235 69.7685 75.7620 88.5059 100.4747 112.4684 117.9486 141.7731 146.8382 152.4201 162.2855 172.4057 187.6771 196.9241 205.9057 228.9942 244.0329 286.9608 313.0731 322.2888 334.9904 342.1407 354.7308 370.7191 395.4158 410.2141 413.1907 422.3541 440.4570 480.6514 505.2840 529.8785 533.1063 542.9203 548.5555 574.2396 583.1402 586.0638 607.3575 617.9489 626.7453 653.6878 663.8146 713.0255 724.0108 733.5128 776.6024 801.6769 819.5301 843.3666 859.0619 870.2657 903.8385 927.1985 934.4222 946.4012 960.7115 973.3569 984.8600 988.2102 994.1907 1009.9640 1034.1487 1036.6325 1037.9125 1039.7821 1066.5652 1096.6216 1097.4473 1104.1065 1111.8689 1155.5988 1168.8534 1181.1751 1197.5316 1206.6423 1214.8079 1277.7551 1293.1340 1302.5927 1341.0453 1367.7130 1385.2969 1391.8699 1395.3216 1411.4637 1435.0128 1437.5300 1439.5536 1448.4254 1453.9611 1458.3444 1464.1186 1479.6221 1487.5447 1576.4217 1591.5451 1643.6518 1691.7260 2978.0290 2993.3106 3022.4653 3037.7961 3061.2683 3075.7584 3094.4113 3115.6223 3121.7107 3131.5306 3152.8664 3160.8054 3175.3873 3178.0663 3469.2085
redmass: 5.8860 6.9860 6.0039 6.2355 5.5300 7.4350 5.4596 5.9106 6.7555 6.0566 6.6075 4.6868 1.3902 3.2612 3.4812 1.3179 7.7168 7.5222 7.5438 3.5232 5.2186 7.0054 4.1993 4.2482 6.3246 6.3564 4.2260 5.2721 7.2409 6.4716 3.5661 3.9883 4.5978 6.5653 4.7213 4.3472 4.9342 7.2829 3.8554 4.7653 8.1378 4.1286 4.1433 11.9673 4.8632 5.8134 6.4487 3.9427 5.2793 2.9634 4.9369 3.6767 7.3860 3.7018 10.2447 1.2928 2.7769 1.5267 4.0084 2.4235 2.9780 3.3730 8.5276 3.0327 1.6824 3.1969 1.3720 2.6592 2.0286 2.1463 2.2830 2.5291 4.6760 3.4379 3.0807 2.3267 1.3361 1.7491 3.0452 1.2361 1.9969 1.8503 2.1145 1.7599 1.2762 1.3619 1.3179 1.2660 5.1770 9.5936 1.2208 4.7028 4.9764 1.0619 1.9748 1.0717 1.0465 2.0932 1.0858 1.0879 2.0356 6.4499 7.2921 8.8377 12.5433 1.0378 1.0367 1.0610 1.0620 1.0949 1.0982 1.1022 1.0989 1.1073 1.1003 1.0914 1.0890 1.0953 1.0978 1.0779
irintensity: 0.6314 1.4181 1.0555 2.4961 0.7007 5.1920 1.6602 2.0009 1.2029 0.3971 0.7548 1.9685 0.6596 2.9614 2.9456 0.8110 6.3287 5.4641 10.4389 0.8101 1.2102 3.3795 25.3492 11.7951 16.9963 11.1663 1.0040 6.4950 27.0474 2.5303 5.6572 38.9481 5.6019 82.7028 75.4619 3.5328 8.7004 23.0324 33.5090 16.3496 24.5943 12.0558 9.6519 8.7702 16.5579 12.7566 78.6758 4.9296 2.0015 142.6520 18.9110 1.6082 2.8866 40.2582 77.8216 10.2739 9.2818 65.1561 26.6114 16.5098 40.0911 14.5674 53.0135 49.3394 1.7444 6.7903 1.4929 19.4107 19.9783 13.2585 37.8773 73.1436 158.3533 29.2474 22.3256 0.5685 4.2385 11.3049 53.0444 24.0686 23.5713 43.0139 49.6561 66.9393 3.2997 9.5793 5.8769 67.8427 21.9252 16.9860 9.2774 8.6663 50.0478 35.2996 78.5019 51.6089 21.5834 23.9079 19.2718 7.3620 22.6054 3.5122 3.0868 193.4825 234.5293 2.6482 14.2968 6.4171 32.2018 2.2116 9.1568 4.6684 3.3237 13.5775 11.2899 29.0384 3.1656 1.4635 3.3791 55.9907
temp: 298.150 k
press: 1.00000 atm
elementType: 16 16 8 8 8 8 8 7 7 7 7 7 6 6 6 6 6 6 6 6 6 6 6 6 6 6 6 1 1 1 1 1 1 1 1 1 1 1 1 1 1 1
symmnumber: 1
zpe: 760533.5 jmol-1
zpe.correction: 0.289672 hartree
zpe.thermalcorrener: 0.317260 hartree
zpe.thermalcorrenthalpy: 0.318205 hartree
zpe.thermalcorrgfe: 0.226734 hartree
zpe.sumelectzpe: -2024.364564 hartree
zpe.sumelectthermal: -2024.336975 hartree
zpe.sumelectthermalent: -2024.336031 hartree
zpe.sumelectthermalfe: -2024.427502 hartree
dipole: -3.3261 1.4753 -0.6521
dipole: 3.6966
quadrupole: -170.9232 -175.2564 -176.6344
quadrupole: -28.3420 -30.9108 2.4529
quadrupole: 3.3481 -0.9850 -2.3631 -28.3420 -30.9108 2.4529
hfenergy: -2024.6542358 hartree
pointgroup: C01 [X(C15H15N5O5S2)]
dipole: 1.1994773 0.7798368 -0.2611538 debye
polarizability: 415.2043593|16.2073197|264.4303196|-25.9599745|-53.1243408|210.00369 unknown
InChI: InChI=1S/C15H15N5O5S2/c1-9(21)15(7-8-25-13(15)22)20-17-11-3-5-12(6-4-11)27(23,24)19-14-18-16-10(2)26-14/h3-6,19H,7-8H2,1-2H3
charge 0 multiplicity 1
42 atoms
S  3.508046 -0.871177 1.145153
S  6.19724 1.071116 -1.836437
O  -5.57025 -1.81633 0.722677
O  -4.94364 -1.973244 -1.506576
O  -6.105597 1.73298 -1.325007
O  3.90658 -2.408988 1.488105
O  3.961467 0.365557 2.085198
N  -3.081137 0.317789 -0.104015
N  -2.503526 -0.795631 0.230677
N  4.24563 -0.646357 -0.661573
N  3.733198 1.669073 -0.94532
N  4.260351 2.868013 -1.425378
C  -4.568738 0.175635 -0.229037
C  -5.242567 0.547229 1.113191
C  -5.415171 -0.812923 1.820528
C  -5.015463 -1.31677 -0.458657
C  -5.053541 1.056998 -1.425922
C  -4.218727 0.978127 -2.679406
C  -1.076643 -0.709926 0.416857
C  1.651641 -0.79085 0.813085
C  -0.320022 0.492147 0.322628
C  -0.449178 -1.946864 0.710541
C  1.072008 0.458793 0.522984
C  0.946299 -2.000105 0.910473
C  4.571465 0.626892 -1.070244
C  5.481542 2.770035 -1.943798
C  6.228527 3.899308 -2.580727
H  -4.635111 1.25701 1.698377
H  -6.213711 1.02028 0.882507
H  -6.32383 -0.879691 2.436772
H  -4.530578 -1.107766 2.410526
H  -4.66669 1.580927 -3.482888
H  -4.141238 -0.081435 -2.992947
H  -3.191402 1.32893 -2.466984
H  -0.829815 1.431131 0.089168
H  -1.067536 -2.84754 0.769772
H  1.693933 1.35439 0.424119
H  1.46675 -2.934583 1.140662
H  4.93798 -1.400099 -0.783441
H  6.459482 3.68487 -3.639886
H  5.603989 4.805691 -2.532557
H  7.18288 4.099163 -2.061599
