program: Gaussian 09
title: 000281325
version: EM64L-G09RevD.01
frameworkgroup: C1[X(C8H8O4)]
method: RPBEPBE
basis: SDD
operation: Freq
keyword: #p
keyword: freq=noraman
keyword: PBEPBE/SDD
title: #p freq=noraman PBEPBE/SDD
converged: NO YES NO NO
title: Mulliken charges:
elementType: O O O O C C C C C C C C H H H H H H H H
charge: -0.211221 -0.186857 -0.386421 -0.234929 0.313196 -0.499081 -0.293229 -0.681879 0.053781 -0.273339 0.195545 0.134201 0.208807 0.237962 0.253190 0.225185 0.215665 0.257786 0.280174 0.391465
chargesum: 0.00000
title: Mulliken charges with hydrogens summed into heavy atoms:
elementType: O O O O C C C C C C C C
charge: -0.211221 -0.186857 0.005044 -0.234929 0.313196 -0.052312 -0.040039 0.016756 0.053781 0.006835 0.195545 0.134201
polarizability: 1.62385084e+02 6.51129473e+00 1.05348320e+02 -4.72256597e+00 4.44253593e-01 5.22302544e+01
1716.lowfreq: -5.8288 -0.0008 -0.0007 0.0005 6.0558 9.6656 51.6860 59.8987 83.1855
frequency: 51.6826 59.8948 83.1795 142.0937 153.5541 189.5895 213.4217 300.4577 312.4625 355.1402 399.7596 452.8992 501.9396 529.0031 533.7056 583.0141 626.3016 680.9834 692.2932 727.1163 742.6876 788.4806 843.5588 869.3623 941.0360 961.5431 973.5722 1027.1323 1039.2292 1064.1500 1111.5204 1152.8509 1220.2944 1245.6656 1308.0587 1322.8616 1357.5179 1374.7403 1389.9089 1460.1502 1475.1622 1489.9620 1564.4410 1609.5624 1618.1807 1679.4462 2991.5702 2995.2048 3053.4295 3088.1224 3105.0900 3140.8207 3196.1128 3520.3933
redmass: 7.2051 3.5408 3.5795 9.9548 4.3271 3.9555 1.3361 2.2250 5.9633 4.1944 10.0292 5.2611 5.5040 4.0648 3.1247 5.4592 1.4718 7.5771 4.8998 6.3264 5.8159 1.2524 5.1063 1.3190 6.2353 1.4044 2.6819 3.5311 1.8753 1.7501 1.4570 2.0812 2.1902 1.2197 1.4322 2.1662 2.9898 2.4102 1.2268 1.0912 1.0483 1.0581 8.3056 6.1934 9.3753 11.7161 1.0352 1.0592 1.1020 1.1006 1.1011 1.0921 1.0946 1.0643
irintensity: 4.3564 0.6100 1.2616 0.3625 1.1635 1.2210 1.3494 0.3951 5.0859 2.6482 4.6905 3.3008 4.9527 23.3455 22.0255 33.9608 124.2495 12.9405 9.9468 40.6123 1.1108 4.2284 53.8991 42.9927 19.4611 0.9068 3.0118 254.6356 30.9871 18.5120 54.7421 77.5738 3.9314 1.2794 1.7050 78.4228 63.0657 54.6589 16.9777 7.3025 18.1652 13.1779 11.1494 7.2225 272.1849 383.2566 37.3972 22.4676 9.1701 36.4741 22.1833 13.6564 0.4008 65.0869
temp: 298.150 k
press: 1.00000 atm
elementType: 8 8 8 8 6 6 6 6 6 6 6 6 1 1 1 1 1 1 1 1
symmnumber: 1
zpe: 384661.1 jmol-1
zpe.correction: 0.146510 hartree
zpe.thermalcorrener: 0.157875 hartree
zpe.thermalcorrenthalpy: 0.158820 hartree
zpe.thermalcorrgfe: 0.108549 hartree
zpe.sumelectzpe: -609.656448 hartree
zpe.sumelectthermal: -609.645082 hartree
zpe.sumelectthermalent: -609.644138 hartree
zpe.sumelectthermalfe: -609.694409 hartree
dipole: 0.8979 -3.3844 0.0994
dipole: 3.5029
quadrupole: -61.4550 -74.7987 -69.1568
quadrupole: -12.6448 -0.5348 1.7955
quadrupole: 7.0152 -6.3285 -0.6867 -12.6448 -0.5348 1.7955
hfenergy: -609.8029576 hartree
pointgroup: C01 [X(C8H8O4)]
dipole: 0.3216897 1.3332331 0.13542 debye
dipolederiv: -0.5639811 0.5795041 0.0373831 -0.1929567 -0.4988925 -0.0495777 -0.0643065 0.0035866 -0.1741247 -0.6559018 0.3077527 0.0232282 0.5908994 -1.0283129 -0.0375891 0.0681787 -0.0534363 -0.321801 -0.5339226 -0.3965668 -0.0624732 -0.5998058 -1.0616919 -0.1398902 -0.105231 -0.1386542 -0.4269552 -1.129242 0.2403106 -0.0119671 0.2251218 -0.7226239 -0.0513281 -0.0352154 -0.0413191 -0.3291303 0.4873699 -0.039193 -0.0245988 0.3409747 -0.4427654 -0.0367635 0.0887895 -0.0702318 -0.0841026 -0.1336388 0.039216 0.0460747 0.1412192 0.1313431 0.0041866 0.2074438 0.0109262 0.052989 0.1018393 -0.0724606 0.0387175 0.215738 0.2337415 0.0469813 0.0466694 0.0373469 -0.0713697 -0.0134532 -0.0132005 0.033072 -0.0768473 0.0513087 -0.0267789 -0.1626132 -0.0387292 0.0317814 0.7943913 -0.5768005 -0.0246539 -0.9183395 1.2939676 0.0631658 -0.097632 0.0872701 0.2621471 -0.0867184 0.0007286 -0.0046061 -0.1265749 -0.0868586 -0.0016302 -0.0168135 0.0101217 -0.1370534 -0.5997273 -0.3423464 -0.0747788 -0.080619 0.3933518 0.0270969 -0.0711933 0.0075109 0.1214909 2.0289284 0.2204242 0.1413712 0.4019691 1.4053437 0.2081066 0.2140329 0.2012421 0.2826989 0.0092286 -0.002039 0.009681 -0.0806011 -0.0997894 -0.1186294 -0.0187634 -0.0746305 0.0239435 0.0185474 0.0081319 -0.0247081 0.0206482 0.0159482 0.113512 -0.0441172 0.0637317 -0.0098146 0.0493301 -0.0851121 -0.0239155 -0.0834776 -0.0271612 -0.0291937 -0.0201112 -0.0306875 0.1300855 -0.2339293 -0.0167289 0.0064239 -0.0145958 0.1130236 -0.0011137 0.0322315 -0.0036776 0.0637642 0.0766471 0.078426 -0.0491767 0.032624 -0.0275996 0.1285418 0.0056928 0.0825647 -0.0438582 0.134717 -0.0660933 -0.0289467 -0.0145196 -0.0541849 -0.0897452 -0.0303959 -0.038162 0.0526003 0.0688103 0.0562352 0.0020618 0.0572085 0.0782779 -0.0096584 -0.0024826 -0.0104775 0.1733414 0.1807051 0.0798119 -0.0081885 0.1619342 0.3335742 0.0003071 0.0058365 -0.0042951 0.4033677 unknown
polarizability: 162.7690022|-5.5433883|103.967218|2.4040093|7.6115024|53.2274386 unknown
InChI: InChI=1S/C8H8O4/c1-2-5-3-4-6(7(9)10)12-8(5)11/h3-4,9H,2H2,1H3
charge 0 multiplicity 1
20 atoms
O  -0.474049 -0.953419 -0.068567
O  1.597986 -1.985911 -0.03185
O  -3.090228 -1.306406 -0.357464
O  -3.543371 0.956197 -0.043086
C  1.567507 0.431827 0.292512
C  3.075676 0.512372 0.393876
C  0.733997 1.538833 0.393106
C  3.776152 0.300135 -0.977193
C  0.995117 -0.902373 0.059543
C  -0.691699 1.429607 0.262316
C  -1.248613 0.186234 0.032131
C  -2.720588 0.009958 -0.117718
H  3.361428 1.495052 0.81247
H  3.433522 -0.26878 1.091266
H  1.178614 2.523654 0.575956
H  4.871895 0.367799 -0.856842
H  3.461282 1.065637 -1.708733
H  3.536494 -0.696484 -1.384009
H  -1.354389 2.293877 0.337257
H  -4.080533 -1.353714 -0.450471
