program: Gaussian 09
title: 000281329
version: EM64L-G09RevD.01
frameworkgroup: C1[X(C11H15NO2)]
method: RPBEPBE
basis: SDD
operation: Freq
keyword: #p
keyword: freq=noraman
keyword: PBEPBE/SDD
title: #p freq=noraman PBEPBE/SDD
converged: NO YES NO NO
title: Mulliken charges:
elementType: O O N C C C C C C C C C C C H H H H H H H H H H H H H H H
charge: -0.282016 -0.301297 -0.133788 -0.491225 -0.309683 0.250178 0.376074 -0.619167 -0.637321 -0.352191 -0.386249 -0.225219 -0.198313 -0.258122 0.239803 0.240073 0.229760 0.229465 0.237132 0.236853 0.236914 0.226905 0.227004 0.285615 0.257996 0.246406 0.223119 0.225028 0.226266
chargesum: 0.00000
title: Mulliken charges with hydrogens summed into heavy atoms:
elementType: O O N C C C C C C C C C C C
charge: -0.282016 -0.301297 -0.133788 -0.011349 0.149542 0.250178 0.376074 0.091733 0.102203 -0.094195 -0.139844 -0.002100 0.026714 -0.031856
polarizability: 1.90059687e+02 -5.47591310e+00 1.31449220e+02 -2.19186274e-01 -1.34639279e-02 7.10471391e+01
1716.lowfreq: -120.9474 -1.4975 -0.0002 0.0004 0.0005 7.4041 13.6672 30.0106 37.5145
frequency: -120.9363 29.0767 37.4893 60.6711 82.7442 132.1461 139.4193 156.0588 166.1482 214.1369 233.8100 240.3485 322.0917 384.2627 413.1275 424.4653 497.6136 504.2145 558.3514 567.5542 607.6233 611.1899 692.8146 757.0753 758.9017 817.1492 822.1916 832.6918 891.2100 954.5011 962.0092 974.6630 981.6006 986.5606 1023.3884 1048.7574 1053.4842 1083.3062 1089.6618 1094.4627 1134.1836 1143.6167 1164.5362 1166.5995 1180.1224 1221.0211 1250.8403 1278.3823 1282.8370 1315.2081 1364.4173 1387.2655 1394.3006 1415.1797 1441.9002 1444.1952 1449.5932 1473.6328 1475.5064 1480.5452 1485.6063 1491.3913 1492.3557 1588.2849 1592.5175 1612.7511 2966.9341 2973.6080 2987.8035 2994.1127 3037.0881 3043.3148 3049.3014 3065.6751 3102.0236 3115.4471 3127.2519 3135.7725 3155.0209 3163.6039 3172.2482
redmass: 1.0994 4.4362 3.6642 4.5090 3.6557 2.1590 1.8644 1.3273 4.4542 5.9060 4.7362 2.7462 3.8205 3.0343 2.9383 4.5013 4.4572 2.8665 2.7201 5.3948 5.1944 6.2396 2.0566 6.2165 1.6492 1.2781 5.1692 1.2794 1.4543 3.0569 1.3599 6.1625 1.2956 6.4954 2.0406 1.6897 1.4248 1.5151 1.2340 2.9200 1.3512 1.9578 1.1455 1.0780 1.1671 3.5000 5.3884 1.1289 1.5391 1.3337 1.7932 4.7032 2.4194 1.1898 1.1695 2.3744 1.1343 1.0440 1.5773 1.0914 1.3761 1.1104 1.1116 6.6050 6.4616 6.2695 1.0355 1.0365 1.0594 1.0569 1.1008 1.1016 1.1023 1.1076 1.0976 1.0976 1.0846 1.0892 1.0927 1.0953 1.1005
irintensity: 0.2938 2.5718 1.5606 2.8970 0.1927 5.4344 0.7496 2.2550 1.8899 1.3765 0.0106 10.0403 15.5303 6.9449 0.0283 6.0890 4.5914 12.3405 1.9310 2.0196 11.9041 0.5371 35.7169 7.2446 94.0065 1.8569 11.4466 3.6912 7.8436 0.5748 0.1167 79.8778 0.6008 39.7781 28.1856 2.0595 16.4689 12.8020 0.0645 21.1660 0.1699 98.8517 1.3188 7.8782 39.0867 236.9852 17.2574 0.3545 11.0074 1.0207 8.8787 21.2802 105.6895 49.7503 14.6514 3.3014 16.7739 24.5567 101.5644 6.3879 28.5153 25.5819 26.6984 249.4113 47.5188 76.7628 55.6701 59.6082 8.6006 25.3267 0.4056 30.8436 40.1683 41.5625 23.4624 1.3197 2.4894 13.5211 33.1042 22.0399 5.4835
temp: 298.150 k
press: 1.00000 atm
elementType: 8 8 7 6 6 6 6 6 6 6 6 6 6 6 1 1 1 1 1 1 1 1 1 1 1 1 1 1 1
symmnumber: 1
zpe: 628176.8 jmol-1
zpe.correction: 0.239260 hartree
zpe.thermalcorrener: 0.253171 hartree
zpe.thermalcorrenthalpy: 0.254115 hartree
zpe.thermalcorrgfe: 0.196888 hartree
zpe.sumelectzpe: -632.301610 hartree
zpe.sumelectthermal: -632.287699 hartree
zpe.sumelectthermalent: -632.286755 hartree
zpe.sumelectthermalfe: -632.343983 hartree
dipole: -2.9705 2.6255 -0.0031
dipole: 3.9645
quadrupole: -62.7010 -83.3279 -86.7886
quadrupole: -10.9601 -0.0298 -0.0378
quadrupole: 14.9048 -5.7220 -9.1828 -10.9601 -0.0298 -0.0378
hfenergy: -632.5408703 hartree
pointgroup: C01 [X(C11H15N1O2)]
dipole: -1.284502 -0.1299491 0.8752165 debye
polarizability: 190.2249018|5.7116218|71.6954889|2.237085|-4.6184683|130.6356555 unknown
InChI: InChI=1S/C11H15NO2/c1-12(2)11(13)8-9-14-10-6-4-3-5-7-10/h3-7H,8-9H2,1-2H3
charge 0 multiplicity 1
29 atoms
O  0.61538 0.061737 0.775267
O  -2.475297 0.151664 -2.084222
N  -4.107167 -0.055319 -0.428366
C  -1.714261 -0.003265 0.24196
C  -0.316224 0.109079 -0.366993
C  -2.7864 0.039271 -0.85258
C  1.989796 0.15338 0.497249
C  -4.480031 -0.190561 0.991429
C  -5.188719 -0.024245 -1.42981
C  2.534885 0.28227 -0.804965
C  2.842242 0.109017 1.629086
C  3.938603 0.366778 -0.95965
C  4.237653 0.194556 1.45691
C  4.796432 0.324173 0.161055
H  -1.862123 0.820543 0.966839
H  -1.784971 -0.943466 0.822378
H  -0.201223 1.059162 -0.921963
H  -0.118145 -0.72707 -1.063795
H  -5.578331 -0.222595 1.070108
H  -4.122596 0.664305 1.59603
H  -4.081336 -1.121307 1.438361
H  -5.864279 0.833844 -1.252221
H  -5.781259 -0.958233 -1.39878
H  -4.725948 0.078275 -2.423332
H  1.890696 0.317335 -1.688235
H  2.392616 0.008657 2.621901
H  4.358074 0.466533 -1.967262
H  4.891374 0.160006 2.335761
H  5.881559 0.390278 0.03024
