program: Gaussian 09
title: 000025335
version: EM64L-G09RevD.01
frameworkgroup: C1[X(C11H21NO2)]
method: RPBEPBE
basis: SDD
operation: Freq
keyword: #p
keyword: freq=noraman
keyword: PBEPBE/SDD
title: #p freq=noraman PBEPBE/SDD
converged: YES YES NO NO
title: Mulliken charges:
elementType: O O N C C C C C C C C C C C H H H H H H H H H H H H H H H H H H H H H
charge: -0.262275 -0.247680 -0.091434 -0.419943 -0.412695 -0.396365 -0.512726 -0.364418 -0.389694 -0.348824 0.257529 -0.283195 -0.354605 -0.694056 0.214377 0.240016 0.240471 0.216315 0.184987 0.252157 0.246634 0.263656 0.190711 0.191228 0.210355 0.211375 0.189855 0.190431 0.224241 0.224961 0.195413 0.195819 0.210443 0.210136 0.216799
chargesum: 0.00000
title: Mulliken charges with hydrogens summed into heavy atoms:
elementType: O O N C C C C C C C C C C C
charge: -0.262275 -0.247680 -0.091434 0.034450 0.044090 0.040780 -0.002436 0.017521 0.032036 0.031463 0.257529 0.166007 0.036627 -0.056678
polarizability: 1.81232091e+02 1.06315534e+00 1.19945647e+02 7.37122085e-02 7.51813607e-01 1.01234714e+02
1716.lowfreq: -23.1467 -12.8470 -4.2086 -0.0009 -0.0006 0.0007 4.0637 26.2896 34.9302
frequency: -19.5435 25.6101 34.8262 35.6082 58.3377 67.7576 89.0338 110.1599 120.6877 128.6108 166.2349 184.6912 188.0579 225.4974 251.5734 279.3555 341.2496 380.0992 420.2151 440.4917 508.9628 557.8778 658.3310 725.6267 730.3140 745.4516 785.1998 792.6564 811.0809 818.9749 875.2538 881.3182 889.0698 935.3471 973.7063 985.1496 990.1747 1010.6377 1049.8160 1055.0044 1062.1965 1070.7863 1079.3504 1083.8889 1087.4398 1121.0753 1126.7010 1132.5433 1145.5456 1148.3322 1189.0499 1195.1389 1237.5094 1242.2288 1259.3951 1273.3763 1274.9828 1288.6666 1291.3038 1292.3131 1302.9979 1338.6998 1355.9768 1369.2927 1381.2995 1387.5105 1441.1283 1452.4458 1464.2984 1465.4267 1466.3294 1470.3335 1476.0438 1476.6704 1476.8679 1484.7466 1490.1078 1635.0226 2899.5050 2954.2481 2958.9298 2969.0340 2972.2027 2989.6336 2991.2844 2999.1657 3004.7585 3007.7245 3030.3921 3044.8362 3047.1609 3050.1024 3061.3087 3067.7130 3068.5471 3072.1459 3073.9541 3163.3929 3180.7006
redmass: 2.6335 5.3748 2.6653 2.7443 2.9805 2.5068 3.1537 2.5003 2.1203 2.1001 3.6533 2.9783 4.0632 1.1364 3.3115 4.8327 3.3263 2.6550 3.2437 3.2095 3.6836 2.7889 5.6080 1.0658 3.1128 1.0902 1.5292 1.1553 1.2874 3.6110 5.7126 1.2001 2.0357 4.3851 1.2134 1.1459 2.0531 3.8670 3.0268 1.7390 1.3464 2.6325 1.4130 2.1236 2.6246 1.6699 2.7957 2.1348 1.7860 1.4654 1.3488 1.5195 1.2870 1.2936 2.5458 1.1337 1.3197 1.0919 1.2968 1.1047 1.5103 1.4185 1.6224 1.5019 1.6297 1.2165 1.0823 1.0853 1.0737 1.1289 1.0727 1.0745 1.0438 1.0766 1.1204 1.0815 1.0954 9.8295 1.0705 1.0588 1.0590 1.0592 1.0363 1.0599 1.0978 1.0566 1.0606 1.1016 1.1038 1.1045 1.0923 1.0517 1.0619 1.0966 1.1010 1.0993 1.1076 1.1140 1.1151
irintensity: 1.2685 1.1017 0.1502 0.1375 0.4363 0.0644 0.5364 0.9736 1.6252 0.0493 6.2831 5.9380 1.6157 0.0396 0.7064 9.0095 4.5749 3.2791 9.5920 1.3286 4.6152 1.9623 6.5924 12.1365 8.7033 0.1697 8.0126 1.3446 1.4460 6.2885 8.5238 1.1659 8.7789 41.5670 23.4735 0.1408 61.0303 0.7032 24.0590 15.6347 9.0625 21.3158 30.2310 18.7499 6.5634 38.1012 4.2208 235.9459 79.3843 6.2281 1.4149 0.0571 5.7905 0.0285 6.1499 2.6739 34.3344 0.1716 3.2428 0.8870 75.5828 0.1518 0.2150 25.3705 44.9842 11.3258 20.3784 9.2406 0.0022 0.1713 0.1402 2.3263 11.8966 2.3485 9.1591 3.3986 26.7766 175.6805 63.2245 0.0290 8.7145 88.1195 36.3085 15.3553 0.4629 44.7240 12.4649 0.6705 32.2648 18.9766 1.6921 28.7828 34.3124 24.4614 56.9752 52.9715 112.5489 1.8953 43.5791
temp: 298.150 k
press: 1.00000 atm
elementType: 8 8 7 6 6 6 6 6 6 6 6 6 6 6 1 1 1 1 1 1 1 1 1 1 1 1 1 1 1 1 1 1 1 1 1
symmnumber: 1
zpe: 798338.7 jmol-1
zpe.correction: 0.304071 hartree
zpe.thermalcorrener: 0.320561 hartree
zpe.thermalcorrenthalpy: 0.321505 hartree
zpe.thermalcorrgfe: 0.257191 hartree
zpe.sumelectzpe: -635.774243 hartree
zpe.sumelectthermal: -635.757753 hartree
zpe.sumelectthermalent: -635.756809 hartree
zpe.sumelectthermalfe: -635.821123 hartree
dipole: -1.0275 -1.1935 1.1444
dipole: 1.9467
quadrupole: -77.1006 -92.2859 -86.5630
quadrupole: -3.4306 6.0540 -2.4213
quadrupole: 8.2159 -6.9694 -1.2465 -3.4306 6.0540 -2.4213
hfenergy: -636.0783138 hartree
pointgroup: C01 [X(C11H21N1O2)]
dipole: -0.4028042 -0.4280919 0.4910153 debye
polarizability: 181.219751|1.3742506|119.9368842|0.0967903|-0.976648|101.2558169 unknown
InChI: InChI=1S/C11H21NO2/c1-2-3-4-5-10-14-11(13)6-7-12-8-9-12/h2-10H2,1H3
charge 0 multiplicity 1
35 atoms
O  0.109281 -0.075593 -0.165478
O  1.332209 1.899736 0.019227
N  4.939621 -0.475142 -0.455637
C  5.45072 -1.317159 0.690684
C  6.276225 -0.152953 0.161524
C  3.832301 0.462965 -0.121997
C  2.492794 -0.258231 -0.342633
C  -3.680851 0.431254 0.064283
C  -2.313935 -0.277723 -0.083569
C  -4.87331 -0.549046 -0.009147
C  1.298938 0.656409 -0.140326
C  -1.152123 0.712677 -0.011391
C  -6.244503 0.148876 0.138679
C  -7.431123 -0.83628 0.065686
H  4.980894 -1.188159 1.676607
H  5.720745 -2.346404 0.435303
H  7.145575 -0.339185 -0.476332
H  6.351469 0.737947 0.801026
H  3.888094 0.853614 0.922643
H  3.90371 1.33131 -0.800294
H  2.39419 -1.135367 0.32333
H  2.461303 -0.657721 -1.374548
H  -3.715437 0.975926 1.030915
H  -3.790118 1.198841 -0.730067
H  -2.195439 -1.037175 0.713195
H  -2.2719 -0.816593 -1.049704
H  -4.766701 -1.318009 0.784203
H  -4.842221 -1.093631 -0.975867
H  -1.114736 1.247374 0.956126
H  -1.194237 1.467674 -0.81859
H  -6.273898 0.693718 1.104442
H  -6.350021 0.917006 -0.654519
H  -7.443106 -1.371947 -0.902384
H  -7.365328 -1.595774 0.867568
H  -8.399079 -0.313434 0.17424
