program: Gaussian 09
title: 000281321
version: EM64L-G09RevD.01
frameworkgroup: C1[X(C8H14O2)]
method: RPBEPBE
basis: SDD
operation: Freq
keyword: #pfreq=noraman
keyword: PBEPBE/SDD
title: #p freq=noraman PBEPBE/SDD
converged: YES YES NO NO
title: Mulliken charges:
elementType: O O C C C C C C C C H H H H H H H H H H H H H H
charge: -0.454434 -0.433172 -0.226688 -0.122654 -0.108135 -0.505601 -0.504605 -0.104796 -0.474442 -0.412710 0.267194 0.233056 0.209846 0.246270 0.221104 0.221986 0.208215 0.201035 0.203187 0.252222 0.200504 0.224244 0.328730 0.329644
chargesum: 0.00000
title: Mulliken charges with hydrogens summed into heavy atoms:
elementType: O O C C C C C C C C
charge: -0.125704 -0.103528 0.040506 0.110401 0.101711 -0.038227 -0.074404 0.096239 -0.019033 0.012038
polarizability: 9.22744350e+01 3.67795623e-01 8.80962733e+01 1.15525276e+00 -3.18674955e-01 7.78300260e+01
1716.lowfreq: -13.6667 0.0005 0.0005 0.0008 20.2546 24.1739 94.6310 125.7829 154.4788
frequency: 94.2727 125.7768 154.4457 194.1606 292.5030 299.7835 322.8155 361.7419 377.5582 430.4535 467.6306 491.2119 615.8122 741.9203 768.0790 827.6685 839.3926 855.0709 880.3767 917.2900 928.6071 934.7070 950.0156 955.6542 982.4089 991.3989 1023.7092 1046.3525 1066.5922 1093.7559 1109.5972 1117.1850 1145.1122 1167.0997 1175.8210 1190.8762 1230.7844 1244.4201 1259.9604 1269.0763 1270.9433 1295.1385 1306.5005 1316.8990 1325.4660 1359.0373 1369.3368 1373.6081 1458.1577 1464.4694 1469.5602 1481.9932 2947.5893 2953.3308 2960.5554 2985.9222 3014.7656 3017.2881 3053.8862 3059.4117 3066.4734 3070.9197 3082.2103 3089.3331 3554.8453 3557.5652
redmass: 3.1995 3.9354 3.2817 2.4536 1.6890 1.6426 1.2380 2.5811 3.0003 2.2734 2.5777 2.3980 2.6410 4.0604 4.9175 2.6234 2.2542 2.4148 1.7643 2.2459 2.6794 2.6203 2.2605 1.9240 2.5402 2.0021 1.6091 1.4791 1.9456 1.6950 1.1825 1.1695 1.1806 1.7198 1.5033 1.5575 1.5333 1.5059 1.3486 1.3984 1.4020 1.4406 1.5839 1.4238 1.3988 1.3031 1.2765 1.4530 1.0861 1.0901 1.0819 1.0980 1.0751 1.0781 1.0847 1.0629 1.0608 1.0608 1.1014 1.0877 1.0955 1.0922 1.1040 1.1053 1.0657 1.0661
irintensity: 3.8456 1.0982 2.6781 11.6407 72.5288 77.4687 135.1986 6.9989 10.6709 15.7682 12.0363 21.0004 1.9186 0.7735 3.1018 3.8927 8.3332 5.1491 14.2634 14.4513 2.7235 4.3273 42.0527 18.2141 36.9019 46.0126 16.8012 19.8678 1.9326 8.3740 2.8934 13.8372 2.9395 8.6477 42.7543 15.7279 12.4612 3.1047 7.9820 0.8611 3.2822 11.4496 10.0633 7.1675 7.1038 19.7696 10.1591 1.4639 10.8362 8.1469 6.8533 9.5250 46.2935 19.5467 96.2823 57.7330 56.4203 9.3220 29.3984 59.3683 36.1092 14.7288 27.9380 30.1620 4.0175 5.3160
temp: 298.150 k
press: 1.00000 atm
elementType: 8 8 6 6 6 6 6 6 6 6 1 1 1 1 1 1 1 1 1 1 1 1 1 1
symmnumber: 1
zpe: 549362.9 jmol-1
zpe.correction: 0.209241 hartree
zpe.thermalcorrener: 0.218704 hartree
zpe.thermalcorrenthalpy: 0.219648 hartree
zpe.thermalcorrgfe: 0.175099 hartree
zpe.sumelectzpe: -462.866849 hartree
zpe.sumelectthermal: -462.857387 hartree
zpe.sumelectthermalent: -462.856442 hartree
zpe.sumelectthermalfe: -462.900991 hartree
dipole: -0.8635 0.7522 -1.8087
dipole: 2.1408
quadrupole: -72.5183 -57.5669 -58.8851
quadrupole: -1.0762 4.6524 2.8033
quadrupole: -9.5282 5.4232 4.1050 -1.0762 4.6524 2.8033
hfenergy: -463.0760906 hartree
pointgroup: C01 [X(C8H14O2)]
dipole: 0.3224278 0.2962525 0.7194748 debye
dipolederiv: -0.6104371 -0.4258815 0.005929 -0.4113282 -0.5141608 -0.0403352 -0.0067725 -0.0704939 -0.543126 -0.8368995 0.1757946 -0.0485189 0.2250257 -0.7023232 0.0178025 -0.0346971 0.0250794 -0.1034048 -0.126892 -0.1123016 -0.0035503 -0.0326028 0.0195682 0.0066557 0.0855973 0.0157514 -0.0212919 0.1309144 -0.0173315 0.0349924 0.0066993 0.1294153 -0.0550883 0.0464903 -0.068281 0.061611 -0.0988476 0.0241181 -0.0057267 0.0279162 -0.0364361 0.0009059 0.1179607 -0.0367324 0.1324209 0.0411093 0.0268722 -0.0072212 0.0403462 -0.0274177 0.0078914 -0.0379376 0.0007826 -0.0268234 -0.0357997 0.0595984 -0.051012 0.0170881 0.0577404 0.0061934 -0.0672069 -0.0009165 0.1055668 0.4748833 0.3048612 0.0562724 0.2266446 0.5159852 0.037954 0.0245176 0.0671153 0.4025097 -0.0075801 0.0352304 0.0154777 0.0096846 -0.0850312 0.0233036 -0.0029176 0.0439894 0.0961677 0.5504131 -0.1738921 0.0590401 -0.1747722 0.5530648 -0.024474 0.0076654 -0.0204765 0.2269557 0.0668995 0.0656825 0.0290962 0.0573346 -0.1237898 -0.0449996 0.024467 -0.0447849 0.0479487 -0.0110329 0.0893529 -0.0333731 0.0855637 -0.140382 0.0745999 -0.0427355 0.0819405 0.0427823 0.0172711 0.0195814 -0.0072661 0.0111814 0.0117575 0.0874503 -0.0609896 0.0943526 -0.181495 -0.0411878 -0.0374487 -0.132207 -0.041085 0.060465 -0.0686446 -0.0855153 -0.0472206 -0.0008511 -0.0574995 -0.0568899 0.1556246 -0.0579644 0.0351421 0.0594543 0.1159388 0.0438494 -0.0262217 -0.0637 -0.1276645 0.059954 -0.0910961 -0.0400964 0.0380915 0.0829238 0.0954528 0.0169871 0.04268 0.0360639 0.0277112 0.0191102 0.0044525 -0.0669323 0.0081425 -0.1337716 -0.1388774 -0.024849 -0.0181559 -0.0892142 -0.0076722 -0.0498906 0.0714238 -0.0617854 0.0702158 -0.2034545 0.0762484 -0.0100495 0.0053272 0.0226784 0.0108723 -0.0672018 0.0746285 -0.0872242 -0.14987 -0.1041705 -0.0067401 -0.0369587 -0.0248689 0.0766297 -0.0040987 -0.0863432 0.0086081 0.0578531 -0.1068309 -0.0698916 -0.0615338 -0.0788863 -0.1399835 -0.0681271 -0.0921165 -0.1095231 0.0092385 0.0862495 0.0279016 -0.0208827 0.0225759 0.0188534 0.0400681 0.020896 0.0709473 -0.110939 0.2225435 0.2131497 -0.0243716 0.1445647 0.0988607 -0.0302647 -0.0495397 -0.0419042 0.3270849 0.4165142 -0.0219601 0.0724116 0.0038626 0.2667042 -0.0016282 0.0193287 0.0432444 -0.0207717 unknown
polarizability: 92.2170761|-0.3622174|88.0929664|1.4806175|0.3270785|77.8906918 unknown
InChI: InChI=1S/C8H14O2/c9-4-6-1-5-2-7(6)8(10)3-5/h5-10H,1-4H2
charge 0 multiplicity 1
24 atoms
O  -2.274007 -1.713336 -0.104163
O  3.037476 -1.198807 0.056634
C  0.001049 -0.639431 -0.323997
C  -0.925348 1.443213 -0.325903
C  1.007544 0.197789 0.530525
C  -0.484833 0.389486 -1.382704
C  0.397666 1.650989 0.469806
C  -1.282898 -0.823712 0.534677
C  -1.903116 0.60935 0.557929
C  2.447567 0.150499 -0.00999
H  0.434556 -1.584238 -0.693404
H  -1.364347 2.375448 -0.717055
H  1.02345 -0.175657 1.577425
H  -1.322042 0.003741 -1.988759
H  0.31571 0.749173 -2.053354
H  1.074547 2.336935 -0.07676
H  0.223101 2.082713 1.471538
H  -1.035818 -1.208459 1.547145
H  -2.001786 1.01582 1.579873
H  -2.909762 0.552042 0.108216
H  3.082269 0.883298 0.534537
H  2.473454 0.404446 -1.083784
H  -1.874657 -2.615731 -0.198843
H  3.075425 -1.478374 1.00641
