program: Gaussian 09
title: 000281369
version: EM64L-G09RevD.01
frameworkgroup: C1[X(C19H18N6O4S2)]
method: RPBEPBE
basis: SDD
operation: Freq
keyword: #p
keyword: freq=noraman
keyword: PBEPBE/SDD
title: #p freq=noraman PBEPBE/SDD
converged: YES YES NO NO
title: Mulliken charges:
elementType: S S O O O O N N N N N N C C C C C C C C C C C C C C C C C C C H H H H H H H H H H H H H H H H H H
charge: 1.036975 0.234547 -0.466591 -0.466111 -0.241745 -0.179728 -0.457978 -0.618675 -0.106086 -0.088392 -0.056480 -0.001949 -0.154201 -0.351399 0.327151 0.272574 0.153776 -0.214430 -0.209498 0.177097 -0.249105 -0.321029 -0.345464 0.216842 -0.379982 -0.843646 -0.233199 -0.243271 -0.762780 -0.004182 -0.399436 0.287242 0.295090 0.297816 0.397120 0.278747 0.274064 0.300470 0.232779 0.365017 0.246722 0.233360 0.231792 0.231161 0.230849 0.243658 0.294850 0.255270 0.280387
chargesum: 0.00000
title: Mulliken charges with hydrogens summed into heavy atoms:
elementType: S S O O O O N N N N N N C C C C C C C C C C C C C C C C C C C
charge: 1.036975 0.234547 -0.466591 -0.466111 -0.241745 -0.179728 -0.060858 -0.253658 -0.106086 -0.088392 -0.056480 -0.001949 -0.154201 -0.064157 0.327151 0.272574 0.153776 0.080660 0.088319 0.177097 0.029643 -0.046966 -0.044994 0.216842 -0.147203 -0.131771 -0.002038 -0.012422 0.030997 -0.004182 -0.119049
polarizability: 5.53997363e+02 1.55512364e+00 3.18625179e+02 1.32219886e+01 1.15149317e+01 2.11801255e+02
1716.lowfreq: -14.0298 -0.0011 0.0005 0.0013 1.3843 3.2427 4.2998 9.5513 14.6564
frequency: -13.9110 9.3758 14.6498 17.5443 23.5578 30.2015 34.5946 41.9253 46.6360 56.2890 73.5070 90.0939 97.2930 102.5387 123.8457 138.3465 147.0422 150.9873 181.7924 186.3262 188.2340 195.3029 204.8078 210.0758 222.2499 262.0682 281.1325 285.8924 301.6961 303.5543 339.7677 343.9965 375.5187 394.2080 398.9324 413.3388 419.9471 440.3028 447.0053 486.9754 498.7775 518.0009 523.7062 538.0560 539.7556 548.7626 562.6860 573.0210 578.6791 601.0335 614.4745 627.0576 638.9841 681.0425 705.2053 727.3707 728.9823 736.1383 738.3615 769.6581 783.1761 800.5020 812.1284 818.6661 827.5849 841.0280 847.5651 851.0522 871.8237 882.7078 933.2531 950.4651 957.8729 967.1308 972.3416 980.6693 983.5651 988.6494 994.0260 996.6818 1025.2735 1038.8122 1044.7244 1046.1976 1049.1807 1107.4699 1111.9808 1112.5290 1140.1631 1151.7824 1162.8983 1176.3985 1178.6077 1189.0853 1199.0203 1214.3698 1266.0505 1278.0307 1286.4110 1293.9100 1301.3504 1375.9658 1377.8175 1391.4518 1392.6011 1394.0808 1399.1575 1427.8163 1440.2262 1441.6809 1453.4003 1455.3495 1461.5923 1480.7094 1487.4991 1495.0178 1524.4317 1576.1213 1591.9902 1594.7502 1617.0850 1627.8750 1641.6355 2956.5667 2981.8351 3008.8116 3026.7888 3066.6725 3090.6410 3125.7566 3126.6849 3141.2066 3152.9144 3157.5507 3162.9234 3173.6157 3176.8898 3190.3846 3239.3746 3389.4803 3571.0559
redmass: 7.1564 9.7803 6.6688 5.4578 6.9297 6.3491 6.1290 5.4110 5.6510 5.6545 6.7888 5.3407 6.2649 7.0352 1.9336 6.2515 4.6290 1.0473 6.4328 1.1459 4.1532 4.5111 10.6238 8.3970 6.5265 5.3868 3.2512 5.0920 5.5254 5.9349 9.0669 8.4450 5.2639 5.6199 7.3528 3.1958 4.3145 8.8586 2.9746 4.3489 4.6089 5.0068 6.3493 6.8810 4.5928 4.8514 5.3981 4.7385 10.8389 6.2230 6.8997 6.5951 6.6615 5.9460 5.1062 2.8443 4.2754 1.2210 6.7664 1.3058 4.7018 3.0704 1.4424 7.2102 10.5152 4.0061 3.2618 1.2988 1.8567 1.3036 4.1638 2.5428 1.3729 5.1565 14.7051 1.3968 1.6042 2.0399 2.2178 1.3139 1.8701 4.5817 1.5334 2.5138 2.1833 1.3058 3.2996 2.0524 2.0934 2.0737 1.7147 1.0969 1.2308 1.9650 2.0037 1.8775 1.7753 1.6316 1.2893 1.6419 1.5829 1.4189 3.7513 8.8726 3.4629 9.8503 1.2788 8.6874 1.8170 1.1681 1.1350 2.0708 1.7405 1.0476 1.5281 9.5356 1.8731 6.5610 7.3717 5.7595 5.2891 7.5785 8.3522 1.0400 1.0377 1.0828 1.0978 1.0949 1.0951 1.1013 1.0871 1.0905 1.0895 1.0893 1.0982 1.0958 1.0975 1.0955 1.0967 1.0763 1.0800
irintensity: 12.6716 3.9034 2.0444 0.7414 0.5942 0.9113 0.9545 0.7282 1.7828 2.7245 2.7603 2.0517 1.8078 2.9245 57.2522 1.1912 22.2840 0.2523 11.8904 1.5769 2.0272 7.6985 4.3502 3.3019 6.9671 5.5055 8.6204 3.8937 14.4494 17.4621 8.0870 11.2330 17.1855 34.6784 22.4597 0.9157 13.6684 154.9024 7.8292 31.7095 34.2396 10.1350 5.3207 0.0444 7.6425 8.6620 120.2935 6.2122 2.5255 35.3585 6.2884 53.7288 3.8486 9.8388 2.0181 10.9743 35.1395 37.5090 30.1443 59.7093 2.7657 8.3698 62.6064 2.4096 137.2285 6.7250 18.0998 3.4047 43.8471 2.8637 34.5342 2.9748 3.4995 61.6877 79.1801 5.6677 3.0596 3.7294 0.7612 1.4876 25.9309 46.1373 9.1736 33.8410 14.0650 3.9540 15.6093 13.9236 164.9179 141.8491 28.6723 0.9073 0.3894 16.6954 4.2958 34.4701 11.3205 9.2043 4.8347 148.8089 7.6551 110.0610 23.3179 3.6925 28.3998 18.0101 7.2665 10.1623 16.0902 22.4528 25.4074 22.4828 119.4087 14.3462 63.1032 629.3920 342.4703 0.2601 2.3768 41.7403 10.4705 224.5386 104.3421 29.5968 5.7068 10.1794 18.5446 5.1454 17.2650 5.4673 4.6248 17.2799 3.0740 2.9130 34.2237 0.0202 1.4886 5.5987 4.6787 126.3640 66.7763
temp: 298.150 k
press: 1.00000 atm
elementType: 16 16 8 8 8 8 7 7 7 7 7 7 6 6 6 6 6 6 6 6 6 6 6 6 6 6 6 6 6 6 6 1 1 1 1 1 1 1 1 1 1 1 1 1 1 1 1 1 1
symmnumber: 1
zpe: 911278.4 jmol-1
zpe.correction: 0.347088 hartree
zpe.thermalcorrener: 0.377394 hartree
zpe.thermalcorrenthalpy: 0.378338 hartree
zpe.thermalcorrgfe: 0.279629 hartree
zpe.sumelectzpe: -2157.865738 hartree
zpe.sumelectthermal: -2157.835431 hartree
zpe.sumelectthermalent: -2157.834487 hartree
zpe.sumelectthermalfe: -2157.933197 hartree
dipole: 4.1189 5.0593 -1.2664
dipole: 6.6458
quadrupole: -226.4700 -193.6836 -200.6194
quadrupole: -40.9883 12.9187 10.7682
quadrupole: -19.5457 13.2407 6.3049 -40.9883 12.9187 10.7682
hfenergy: -2158.2128255 hartree
pointgroup: C01 [X(C19H18N6O4S2)]
dipole: 1.6439956 -2.0271316 -0.1562542 debye
polarizability: 553.9469829|5.5343686|301.0382586|-12.956882|41.1956128|229.4385565 unknown
InChI: InChI=1S/C19H18N6O4S2/c1-12-5-3-4-6-16(12)21-18(27)17(13(2)26)23-22-14-7-9-15(10-8-14)31(28,29)25-19-24-20-11-30-19/h3-11,17,21,25H,1-2H3
charge 0 multiplicity 1
49 atoms
S  -4.38588 1.433821 -0.651388
S  -7.542059 -1.661491 0.622852
O  -4.221609 2.374541 0.651744
O  -4.953172 1.995798 -2.055296
O  5.537073 -1.16022 -1.567023
O  2.557008 -3.272166 0.525864
N  4.13268 0.175923 -0.208287
N  -5.307391 -0.142597 -0.183264
N  1.938356 -1.040161 -0.986362
N  0.968832 -1.238165 -1.822168
N  -7.37012 0.997844 0.214109
N  -8.695134 0.757612 0.600913
C  -2.728374 0.575271 -0.976883
C  3.16979 -1.771417 -1.336661
C  5.002884 1.189156 0.288846
C  4.433532 2.163651 1.168478
C  4.415181 -0.872113 -1.055041
C  -1.823345 0.469771 0.095868
C  -2.462906 0.135221 -2.284299
C  -0.267993 -0.585898 -1.469042
C  -0.572591 -0.124471 -0.157916
C  -1.210458 -0.468899 -2.52264
C  6.376301 1.242573 -0.064616
C  3.294326 -3.079389 -0.467257
C  5.278553 3.179149 1.670573
C  2.965241 2.113869 1.558646
C  7.190471 2.269606 0.456079
C  6.647672 3.242152 1.324396
C  4.346966 -4.052324 -0.95273
C  -6.633566 -0.11594 0.169178
C  -8.962212 -0.512145 0.846063
H  3.197149 -2.070442 -2.402773
H  -2.089651 0.855739 1.085403
H  -3.198994 0.276393 -3.082003
H  3.137693 0.219549 0.058616
H  0.165465 -0.253971 0.639206
H  -0.941061 -0.846599 -3.51346
H  6.785898 0.486462 -0.737189
H  4.853796 3.931981 2.344945
H  -4.750411 -0.998938 -0.205267
H  2.717872 2.942075 2.242346
H  2.706794 1.170916 2.080979
H  2.294701 2.207489 0.680467
H  8.24983 2.306085 0.180104
H  7.279323 4.039939 1.729027
H  3.972062 -4.57348 -1.855507
H  5.266648 -3.51697 -1.249452
H  4.558008 -4.800244 -0.173044
H  -9.936478 -0.885144 1.158069
