program: Gaussian 09
title: 000281323
version: EM64L-G09RevD.01
frameworkgroup: C1[X(C15H11NO)]
method: RPBEPBE
basis: SDD
operation: Freq
keyword: #p
keyword: freq=noraman
keyword: PBEPBE/SDD
title: #p freq=noraman PBEPBE/SDD
converged: YES YES NO NO
title: Mulliken charges:
elementType: O N C C C C C C C C C C C C C C C H H H H H H H H H H H
charge: -0.212635 -0.462050 0.190791 0.223896 0.284347 0.025602 -0.412195 -0.376865 -0.359251 0.355107 -0.261368 -0.202013 -0.376131 -0.376256 -0.215359 -0.215395 -0.240700 0.322734 0.233344 0.233716 0.236704 0.228401 0.227677 0.235772 0.235733 0.224751 0.224749 0.226894
chargesum: 0.00000
title: Mulliken charges with hydrogens summed into heavy atoms:
elementType: O N C C C C C C C C C C C C C C C
charge: -0.212635 -0.139315 0.190791 0.223896 0.284347 0.025602 -0.178851 -0.143149 -0.122547 0.355107 -0.032966 0.025664 -0.140359 -0.140524 0.009392 0.009354 -0.013806
polarizability: 2.79497262e+02 -1.14213322e+01 1.38612738e+02 4.22715924e-02 6.97453165e-02 1.07883450e+02
1716.lowfreq: -66.6445 -10.6044 -5.9544 -0.0008 -0.0007 -0.0006 6.3047 38.8698 56.2300
frequency: -66.6156 38.7182 56.2234 92.2844 145.5227 161.8926 219.4636 270.0851 322.2359 347.1173 369.6088 401.1548 437.6385 459.1630 481.8017 534.9270 561.5192 565.7941 593.7809 614.2336 631.8306 668.3297 698.9121 718.4372 736.9135 753.8604 774.6236 780.4058 817.7649 847.5623 860.8614 870.8361 876.9125 911.1470 937.3298 962.4425 972.4519 976.2830 986.7925 992.5300 1021.6111 1027.6964 1078.8830 1097.6941 1154.0896 1172.1364 1172.3958 1187.8359 1189.1272 1236.8120 1239.1559 1288.3843 1308.9838 1321.9252 1339.9689 1367.3542 1413.9030 1426.7078 1463.9031 1470.0832 1479.8438 1582.8962 1602.5219 1608.5405 1629.1087 1644.4200 1677.2016 3062.5215 3123.0999 3129.3474 3129.8485 3137.0921 3141.5415 3150.6529 3151.3045 3165.3662 3168.2852 3591.3436
redmass: 3.8999 5.1498 5.8163 4.7334 6.0646 5.5853 5.5029 4.8539 7.1070 3.0640 3.1198 2.7341 4.0396 3.5527 8.7744 4.2079 2.5889 6.6501 1.3486 6.2619 6.3210 5.9356 2.0768 2.3496 2.9518 1.7381 2.5576 3.6881 4.8705 1.2748 1.3796 4.6847 1.7863 1.4852 1.4153 4.5106 1.3859 1.3219 5.8480 1.3426 2.0356 2.1314 1.6061 2.0728 3.8194 1.1722 1.0514 1.3869 1.5871 1.5248 2.5586 2.0839 1.3813 2.0701 1.7685 6.1917 3.6152 2.2357 3.1545 2.6496 2.5634 5.9477 6.6961 6.1646 7.1350 10.1952 9.4795 1.0874 1.0842 1.0876 1.0856 1.0896 1.0925 1.0970 1.0947 1.1019 1.1003 1.0798
irintensity: 0.1187 1.1426 1.3768 1.0125 0.0879 0.3419 0.3775 3.0474 4.8754 2.5439 0.0041 0.2482 2.4078 5.2865 1.5565 22.6054 19.6159 16.0016 93.1639 1.6376 6.5309 1.9669 38.2672 21.9485 13.5106 50.9441 42.2352 49.0501 5.2324 0.0450 0.1244 2.6734 14.8051 2.5108 2.5279 3.8715 0.3178 0.1598 4.5744 0.5791 6.1713 8.9197 10.9009 28.6801 206.0771 36.6027 0.0356 5.6141 3.9312 7.1017 0.7253 2.8894 0.1660 18.4330 47.8807 0.0217 4.0128 6.5463 72.7352 3.8658 42.1024 1.5242 0.0070 8.9484 151.3588 142.6845 127.9643 20.5867 1.6119 0.2438 2.0881 6.0357 17.4997 41.4433 25.1320 29.8524 24.9469 45.8903
temp: 298.150 k
press: 1.00000 atm
elementType: 8 7 6 6 6 6 6 6 6 6 6 6 6 6 6 6 6 1 1 1 1 1 1 1 1 1 1 1
symmnumber: 1
zpe: 565851.5 jmol-1
zpe.correction: 0.215521 hartree
zpe.thermalcorrener: 0.227909 hartree
zpe.thermalcorrenthalpy: 0.228853 hartree
zpe.thermalcorrgfe: 0.175987 hartree
zpe.sumelectzpe: -707.026700 hartree
zpe.sumelectthermal: -707.014312 hartree
zpe.sumelectthermalent: -707.013368 hartree
zpe.sumelectthermalfe: -707.066234 hartree
dipole: 2.4435 -1.3634 0.0026
dipole: 2.7982
quadrupole: -81.6931 -94.5403 -96.2298
quadrupole: 5.9879 -0.0070 0.0247
quadrupole: 9.1279 -3.7192 -5.4087 5.9879 -0.0070 0.0247
hfenergy: -707.2422213 hartree
pointgroup: C01 [X(C15H11N1O1)]
dipole: 0.9628065 -0.5337997 -0.0001364 debye
polarizability: 279.5579778|-11.0404015|138.551537|0.0283065|0.1394876|107.8839351 unknown
InChI: InChI=1S/C15H11NO/c17-15-13(10-11-6-2-1-3-7-11)12-8-4-5-9-14(12)16-15/h1-10,16H
charge 0 multiplicity 1
28 atoms
O  -0.690563 2.163255 0.001481
N  1.66602 1.889793 0.00136
C  1.879147 -0.409908 -0.000143
C  0.436232 -0.091912 -0.000005
C  2.596704 0.82646 0.000677
C  0.328914 1.425547 0.001119
C  -0.62047 -0.958729 -0.000902
C  2.588792 -1.625881 -0.000925
C  4.001111 0.872461 0.000714
C  -2.07189 -0.603644 -0.000651
C  4.005506 -1.597297 -0.000882
C  4.699057 -0.361995 -0.000076
C  -2.777157 -0.461991 1.222321
C  -2.778845 -0.467614 -1.22329
C  -4.161106 -0.179576 1.221322
C  -4.162775 -0.185083 -1.221684
C  -4.859199 -0.04063 -0.000025
H  1.896518 2.882715 0.001957
H  -0.389389 -2.036565 -0.001876
H  2.059022 -2.585313 -0.001554
H  4.545563 1.82261 0.001332
H  4.569804 -2.535555 -0.00148
H  5.794674 -0.357025 -0.000062
H  -2.238196 -0.55858 2.171435
H  -2.241218 -0.568604 -2.172711
H  -4.691142 -0.062473 2.173287
H  -4.694107 -0.072263 -2.173444
H  -5.932209 0.181295 0.000207
