program: Gaussian 09
title: 000025416
version: EM64L-G09RevD.01
frameworkgroup: C1[X(C16H19NO2)]
method: RPBEPBE
basis: SDD
operation: Freq
keyword: #p
keyword: freq=noraman
keyword: PBEPBE/SDD
title: #p freq=noraman PBEPBE/SDD
converged: YES YES NO NO
title: Mulliken charges:
elementType: O O N C C C C C C C C C C C C C C C C H H H H H H H H H H H H H H H H H H H
charge: -0.264905 -0.228437 -0.099381 0.372528 0.183683 -0.701021 0.401344 -0.344709 -0.300123 -0.414966 -0.384417 -0.450518 0.279735 -0.244119 -0.430572 -0.267053 -0.243772 -0.616816 -0.615619 0.249504 0.247153 0.226607 0.218024 0.238012 0.234128 0.237305 0.264566 0.238738 0.227897 0.237297 0.227194 0.228263 0.226548 0.193431 0.223318 0.223577 0.196765 0.230811
chargesum: 0.00000
title: Mulliken charges with hydrogens summed into heavy atoms:
elementType: O O N C C C C C C C C C C C C C C C C
charge: -0.264905 -0.228437 -0.099381 0.372528 0.183683 -0.204364 0.401344 0.099922 0.172018 -0.177660 -0.119850 -0.211780 0.279735 -0.016223 -0.193275 -0.039859 -0.015510 0.026481 0.035533
polarizability: 1.89731886e+02 -2.43711051e+00 2.16661865e+02 3.30051090e+01 -1.79720936e+01 1.47266993e+02
1716.lowfreq: -11.9729 -6.6101 -2.4165 0.0005 0.0006 0.0009 10.9571 19.4283 21.2959
frequency: 9.1769 19.3084 21.0653 45.8432 60.7656 78.0603 100.2395 147.9285 177.0290 181.6926 209.2494 222.1105 247.5240 263.6908 285.8638 307.1748 351.4982 394.0292 414.4482 416.5659 433.0984 470.5332 473.7674 478.4200 507.3549 539.2782 557.1498 620.5273 635.2729 686.5453 733.2839 745.5440 781.4623 785.1645 797.5588 805.6669 818.2819 836.4020 861.6526 886.4358 917.3917 934.9974 950.2646 964.0250 985.4141 993.3090 1020.6302 1030.7072 1038.1415 1041.1740 1063.4826 1071.5710 1078.5585 1091.3435 1102.9682 1139.8742 1150.7087 1175.0515 1182.0145 1185.7109 1218.4437 1239.6675 1251.3055 1260.1432 1270.8769 1277.0385 1297.3458 1300.7368 1326.4504 1379.0208 1380.7966 1405.7155 1418.8981 1422.0893 1441.4771 1443.2890 1450.9506 1455.7172 1461.1874 1467.0057 1469.8150 1474.6087 1480.0103 1487.8399 1518.5242 1588.4180 1599.6625 1634.1785 1642.5109 2860.5798 2872.0360 2902.2010 3019.4177 3027.3667 3028.9348 3040.3583 3046.6561 3078.0476 3089.0506 3092.0107 3121.3065 3123.5396 3130.2094 3132.8117 3134.6539 3152.1243 3158.6686 3165.4088
redmass: 3.8229 3.0920 4.7279 4.2841 4.3585 4.8571 2.7625 4.2957 3.9178 3.1834 1.2327 1.6022 2.2076 2.9763 3.0968 3.1527 2.7751 2.9646 2.5753 3.3336 2.7229 3.4159 2.9041 4.9023 6.4140 4.5932 4.4031 4.9454 3.5184 4.5350 2.9759 1.4047 2.4151 4.6374 1.4996 2.6640 1.9713 2.7866 2.8020 2.1806 1.7213 2.7143 3.2926 1.3854 1.3651 1.3481 3.4630 2.1768 1.6655 2.3629 2.0436 2.1807 2.4770 1.3187 2.1035 1.4773 1.4551 1.1672 1.2007 1.5997 1.5632 1.8136 1.8181 1.6567 2.3006 1.6045 1.5926 1.2269 1.3425 1.3827 1.9468 3.0977 5.1298 1.1397 1.1338 2.2023 1.1098 2.4621 1.0529 1.1439 1.0598 1.0561 1.0831 1.0548 3.6643 7.5468 5.2810 6.4648 9.3999 1.0561 1.0567 1.0689 1.0737 1.0591 1.0742 1.0707 1.0790 1.1007 1.1004 1.1027 1.0859 1.0861 1.1075 1.0896 1.0918 1.0949 1.0992 1.0992
irintensity: 0.2632 0.2774 0.1322 1.4002 0.7671 1.3003 0.0088 2.1070 1.9440 0.9564 0.6300 0.1119 0.2589 5.5089 4.6035 4.6771 19.4191 1.6820 2.9421 5.3528 1.8759 2.3065 15.3538 8.0606 1.2169 7.8352 5.9867 3.8626 0.3869 0.9302 3.6946 8.8944 23.9534 5.0998 69.5911 23.7878 30.5343 11.2827 0.4999 4.5220 3.0404 27.6916 50.8481 3.8717 2.8618 0.4126 6.9222 30.5844 28.6937 29.4163 7.8041 51.8508 0.5930 10.3110 161.6811 1.9246 4.3186 2.1615 0.5504 1.4184 89.8672 5.9483 9.4470 15.5016 13.5378 2.6253 42.5946 1.9579 3.9990 6.0292 17.2100 4.1186 2.7627 2.9901 1.4565 6.4320 8.9779 0.5948 14.8854 18.4171 6.9514 29.6477 19.3423 9.6440 8.8872 2.5398 7.0110 0.6135 149.1779 73.7566 127.6946 90.3120 44.8912 14.4855 39.4751 32.6954 23.7672 32.5789 38.5340 4.3488 0.4757 0.1928 13.2596 12.0273 23.2419 24.9481 33.5447 17.7489
temp: 298.150 k
press: 1.00000 atm
elementType: 8 8 7 6 6 6 6 6 6 6 6 6 6 6 6 6 6 6 6 1 1 1 1 1 1 1 1 1 1 1 1 1 1 1 1 1 1 1
symmnumber: 1
zpe: 824006.4 jmol-1
zpe.correction: 0.313847 hartree
zpe.thermalcorrener: 0.332193 hartree
zpe.thermalcorrenthalpy: 0.333138 hartree
zpe.thermalcorrgfe: 0.263567 hartree
zpe.sumelectzpe: -824.895731 hartree
zpe.sumelectthermal: -824.877385 hartree
zpe.sumelectthermalent: -824.876441 hartree
zpe.sumelectthermalfe: -824.946011 hartree
dipole: 0.0583 1.6515 -0.1302
dipole: 1.6576
quadrupole: -106.6230 -106.1023 -111.2858
quadrupole: -3.9659 3.5767 2.4788
quadrupole: 1.3807 1.9014 -3.2821 -3.9659 3.5767 2.4788
hfenergy: -825.2095782 hartree
pointgroup: C01 [X(C16H19N1O2)]
dipole: -0.0498761 -0.6159245 -0.2084663 debye
polarizability: 193.6172014|4.5879454|203.5709905|-28.7950796|34.2915821|156.472552 unknown
InChI: InChI=1S/C16H19NO2/c1-17(2)10-11-19-16(18)12-14-8-5-7-13-6-3-4-9-15(13)14/h3-9H,10-12H2,1-2H3
charge 0 multiplicity 1
38 atoms
O  1.994343 1.267391 -1.248681
O  1.635031 2.270188 0.830329
N  4.612153 -0.93273 0.379231
C  -1.273484 1.490937 -0.198007
C  -1.561221 0.127123 -0.584541
C  -0.160199 2.289964 -0.874256
C  -2.641441 -0.577821 0.082666
C  3.273546 -0.542538 -0.116804
C  3.354537 0.835124 -0.802211
C  -2.025962 2.092432 0.818028
C  -0.82337 -0.566962 -1.603539
C  -3.386575 0.08128 1.115193
C  1.222136 1.961018 -0.309057
C  -3.081045 1.392031 1.479683
C  -2.945043 -1.92565 -0.303157
C  -1.145417 -1.879813 -1.957926
C  -2.216351 -2.567664 -1.305552
C  4.850954 -2.389498 0.357955
C  4.940965 -0.335017 1.691184
H  -0.147684 2.129391 -1.964463
H  -0.328781 3.364544 -0.68632
H  2.50816 -0.507711 0.694851
H  2.932419 -1.288564 -0.856979
H  3.950859 0.784156 -1.724925
H  3.76312 1.60064 -0.120791
H  -1.797561 3.122128 1.115549
H  0.01362 -0.066267 -2.099787
H  -4.198599 -0.462088 1.613025
H  -3.648355 1.89447 2.270461
H  -3.765509 -2.445586 0.206107
H  -0.57301 -2.38997 -2.740818
H  -2.458414 -3.596434 -1.594152
H  4.684574 -2.782775 -0.660442
H  4.196444 -2.960586 1.063766
H  5.901801 -2.592804 0.633247
H  6.00442 -0.519836 1.926679
H  4.320348 -0.749419 2.524767
H  4.782892 0.756415 1.667587
