program: Gaussian 09
title: 000281322
version: EM64L-G09RevD.01
frameworkgroup: C1[X(C12H12ClNO2)]
method: RPBEPBE
basis: SDD
operation: Freq
keyword: #p
keyword: freq=noraman
keyword: PBEPBE/SDD
title: #p freq=noraman PBEPBE/SDD
converged: YES YES NO NO
title: Mulliken charges:
elementType: Cl O O N C C C C C C C C C C C C H H H H H H H H H H H H
charge: -0.063560 -0.337416 -0.264851 -0.464327 0.201903 -0.699802 -0.700432 0.484818 0.291363 0.251828 -0.434390 -0.335078 -0.183884 -0.196197 -0.120019 -0.501098 0.226820 0.240425 0.220059 0.221445 0.280797 0.222246 0.330919 0.229841 0.305476 0.255057 0.254684 0.283376
chargesum: 0.00000
title: Mulliken charges with hydrogens summed into heavy atoms:
elementType: Cl O O N C C C C C C C C C C C C
charge: -0.063560 -0.337416 -0.264851 -0.133408 0.201903 -0.012497 0.024056 0.484818 0.291363 0.251828 -0.204549 -0.029603 0.071172 0.058487 -0.120019 -0.217722
polarizability: 2.39181044e+02 9.12300787e-01 1.38952915e+02 1.19701525e+00 -7.07555685e-01 9.49378444e+01
1716.lowfreq: -4.6741 0.0012 0.0015 0.0018 3.6930 5.1338 29.5626 35.7544 65.5751
frequency: 29.5279 35.4194 65.5708 71.0571 105.6785 138.7096 158.1812 168.8862 187.9728 206.6697 221.8829 257.9496 272.1770 327.0356 327.8756 356.7519 363.1896 390.6501 410.9753 422.1145 504.7146 532.2966 548.3575 622.1389 630.8359 633.1662 640.3132 675.9034 695.3092 701.6909 708.9287 725.3658 795.3914 813.4750 841.3293 863.0903 930.4062 936.5502 946.9451 973.7924 974.4708 994.0913 1010.1105 1073.9124 1113.3343 1121.2691 1167.1222 1185.5865 1201.9396 1235.2243 1261.3516 1296.7289 1368.5881 1374.9161 1393.7496 1402.8212 1450.4762 1464.4811 1467.6986 1477.9318 1490.5629 1505.7731 1594.1953 1609.9681 1663.7549 2138.5026 2999.4858 3003.7687 3094.5036 3108.7569 3115.6433 3125.3240 3131.8038 3165.1923 3171.4970 3192.4439 3425.9885 3544.8175
redmass: 6.3382 3.9543 6.5827 6.0936 7.1575 5.1534 3.9369 3.4568 5.0989 1.0822 5.3593 1.1050 6.4102 4.6296 5.3695 2.9844 4.6219 3.6954 3.0201 7.5637 2.7257 4.8683 5.5556 7.1015 1.3740 3.7060 1.3303 1.2563 5.6124 3.8177 6.6860 5.8259 3.6643 1.3843 1.4173 5.6098 1.5533 1.3564 2.0663 6.0253 1.3784 4.0841 1.3278 2.6542 1.5784 1.7440 2.9431 1.1119 3.8300 2.8519 2.1186 1.3418 5.4467 1.1983 1.2046 4.0744 1.0494 1.0501 1.0527 2.2087 1.0527 2.3898 5.7666 6.2362 8.4997 6.0213 1.0357 1.0349 1.1001 1.1004 1.1011 1.0902 1.1002 1.0908 1.0954 1.0956 1.1600 1.0762
irintensity: 0.5248 0.1634 1.3964 2.0567 2.2398 1.0391 1.3396 2.6000 2.5483 0.0694 1.0975 0.0323 7.5672 3.6531 0.4706 3.6903 1.1229 3.7035 0.1723 23.3500 37.8492 3.4742 4.2131 2.9942 71.6231 26.9694 41.5516 61.2851 38.7390 2.0676 22.0634 2.9247 22.3471 43.2673 61.4203 9.9954 6.4859 1.1757 7.8147 367.0084 21.9409 1.2139 17.9148 80.9409 275.6750 275.3018 103.1342 7.2687 14.6571 59.5404 6.7314 16.1519 126.1864 32.1657 28.2043 29.7610 12.2144 1.6942 2.4748 25.9403 15.2523 722.0012 27.0190 46.8311 212.1633 1.4494 12.7471 21.8681 15.0259 34.4587 19.8920 13.6729 5.4900 2.6060 2.8514 5.6901 60.1663 32.2531
temp: 298.150 k
press: 1.00000 atm
elementType: 17 8 8 7 6 6 6 6 6 6 6 6 6 6 6 6 1 1 1 1 1 1 1 1 1 1 1 1
symmnumber: 1
zpe: 552411.9 jmol-1
zpe.correction: 0.210403 hartree
zpe.thermalcorrener: 0.226737 hartree
zpe.thermalcorrenthalpy: 0.227681 hartree
zpe.thermalcorrgfe: 0.165552 hartree
zpe.sumelectzpe: -1128.524576 hartree
zpe.sumelectthermal: -1128.508242 hartree
zpe.sumelectthermalent: -1128.507298 hartree
zpe.sumelectthermalfe: -1128.569426 hartree
dipole: -3.2647 2.6315 -0.4043
dipole: 4.2127
quadrupole: -101.5880 -92.2136 -99.9480
quadrupole: 0.7082 -1.1821 0.2765
quadrupole: -3.6715 5.7029 -2.0314 0.7082 -1.1821 0.2765
hfenergy: -1128.7349787 hartree
pointgroup: C01 [X(C12H12Cl1N1O2)]
dipole: 1.2644553 1.0416698 0.2511266 debye
polarizability: 239.1673305|1.4318417|138.277476|-1.3630023|5.4863248|95.6269968 unknown
InChI: InChI=1S/C12H12ClNO2/c1-4-12(2,3)16-11(15)14-10-7-5-9(13)6-8-10/h1,5-8,14H,2-3H3
charge 0 multiplicity 1
28 atoms
Cl -6.039211 -0.560548 -0.009677
O  2.097841 0.871513 -0.020503
O  0.959866 -1.097122 -0.707237
N  -0.141058 0.811513 0.163516
C  3.47827 0.278726 -0.257199
C  4.407476 1.434841 0.169231
C  3.64913 -0.075717 -1.751555
C  -1.510059 0.439718 0.101962
C  0.960002 0.064934 -0.237044
C  3.674442 -0.895718 0.619917
C  -2.467509 1.387923 0.553568
C  -1.947274 -0.821764 -0.384037
C  -3.844379 1.089274 0.522767
C  -3.326228 -1.119521 -0.415701
C  -4.257388 -0.165781 0.035569
C  3.905092 -1.847163 1.367462
H  4.215299 2.31822 -0.463219
H  4.23231 1.702626 1.223745
H  5.46076 1.129301 0.050706
H  3.435583 0.815071 -2.368159
H  2.973024 -0.893667 -2.039928
H  4.691315 -0.390614 -1.935733
H  0.081406 1.73539 0.540189
H  -2.140377 2.364361 0.931295
H  -1.213789 -1.553362 -0.727968
H  -4.578678 1.820956 0.871192
H  -3.666684 -2.089479 -0.789465
H  4.077217 -2.695809 2.004006
