program: Gaussian 09
title: 000281338
version: EM64L-G09RevD.01
frameworkgroup: C1[X(C14H10N6O2S)]
method: RPBEPBE
basis: SDD
operation: Freq
keyword: #p
keyword: freq=noraman
keyword: PBEPBE/SDD
title: #p freq=noraman PBEPBE/SDD
converged: YES YES NO NO
title: Mulliken charges:
elementType: S O O N N N N N N C C C C C C C C C C C C C C H H H H H H H H H H
charge: 0.974389 -0.536472 -0.478585 -0.640170 -0.077360 -0.067898 -0.084660 0.030586 0.032052 -0.056686 -0.227376 -0.135841 -0.310329 -0.277476 0.292841 0.159331 -0.322569 -0.144438 -0.314890 -0.189313 -0.146580 -0.122256 -0.123119 0.343118 0.300282 0.298117 0.270738 0.289089 0.234414 0.244564 0.240504 0.237811 0.308181
chargesum: 0.00000
title: Mulliken charges with hydrogens summed into heavy atoms:
elementType: S O O N N N N N N C C C C C C C C C C C C C C
charge: 0.974389 -0.536472 -0.478585 -0.297052 -0.077360 -0.067898 -0.084660 0.030586 0.032052 -0.056686 0.072906 0.162276 -0.039591 0.011614 0.292841 0.159331 -0.088155 0.100126 -0.074386 0.048499 0.161601 -0.122256 -0.123119
polarizability: 3.41411791e+02 3.78964802e+00 2.33727749e+02 1.80298334e+01 1.90090607e+01 1.57650055e+02
1716.lowfreq: -6.4672 0.0006 0.0008 0.0011 0.8807 2.5050 10.9956 16.7411 33.3241
frequency: 10.5696 16.7405 33.2943 38.5557 48.1903 62.3012 71.9456 85.0089 108.1477 117.1272 138.0137 178.9633 194.4836 206.9951 213.9669 223.0131 248.6464 258.8975 325.1714 337.0718 354.0087 363.7491 402.2723 406.9940 418.0465 427.2676 449.7590 450.6539 494.2758 512.6901 551.8570 563.4361 587.2484 595.5001 615.2658 622.8840 665.0363 708.5500 734.7430 739.6297 775.0387 794.1607 813.1136 840.6153 853.2702 868.5235 869.9969 898.4768 942.2891 950.4477 951.5242 959.9236 983.5863 988.0835 991.3966 991.9317 1011.3539 1039.7367 1043.3034 1096.6031 1108.8856 1150.2050 1166.9042 1187.5787 1207.9861 1226.8406 1284.9311 1287.9831 1307.5570 1319.0105 1349.1270 1381.9529 1396.7526 1407.9559 1419.3748 1452.9832 1457.3703 1559.0647 1576.4291 1580.6934 1594.9192 2211.3588 2211.9180 2970.9006 3137.5131 3142.4087 3160.0676 3160.6722 3168.9766 3178.3323 3182.1207 3188.4651 3485.4994
redmass: 9.3038 6.7070 5.6906 7.7510 5.8990 7.4903 6.5911 6.9354 11.3318 8.3009 9.6599 7.8670 8.3115 7.8323 10.2267 8.6196 8.2214 10.4119 8.0083 9.2593 8.5293 8.3106 3.5195 3.5128 5.9423 6.2408 1.5874 7.3422 7.2640 2.8496 3.4576 12.3846 7.6789 8.2373 7.4407 6.1158 6.8023 2.9428 3.4528 2.0855 2.0383 7.5186 12.2581 1.2922 5.2307 1.4928 1.3335 8.5632 5.5158 8.5910 1.4871 7.4982 1.3938 1.3356 1.5472 3.7099 3.7186 2.2743 2.4295 1.6046 1.3011 1.6914 1.0725 1.5896 1.4164 1.5232 1.3576 1.2678 2.1877 3.4050 2.0322 6.1499 9.4617 4.3642 2.2047 2.2688 2.1872 5.8008 6.3382 5.9193 7.4047 12.6119 12.5871 1.0809 1.0884 1.0896 1.0955 1.0892 1.0892 1.0973 1.1007 1.0968 1.0776
irintensity: 1.3759 0.7580 0.3579 1.5314 0.3223 2.5665 5.0168 1.1821 2.3035 0.9621 1.7070 10.3510 6.1579 5.6305 2.3902 1.3292 8.8388 7.8697 7.9646 7.8614 17.1472 1.8052 7.3777 11.0617 48.1150 8.4415 64.5450 90.2302 27.1786 19.3778 23.8899 2.1233 11.6137 47.3975 5.6252 5.7320 6.9431 146.8862 0.3527 54.8309 61.9697 43.7361 88.5232 6.6458 34.0602 50.6527 2.9389 11.7572 14.2885 34.0677 5.8655 22.6081 0.5643 0.3086 3.2196 6.0915 19.3924 4.5112 22.8154 5.7849 3.1699 34.8137 5.8617 18.8034 10.7447 6.8784 2.2377 3.6353 25.9789 61.8297 18.1491 86.7795 19.9609 18.5963 80.5566 113.5232 11.9994 11.3207 54.2783 89.4577 7.9284 2.1645 0.6234 8.4994 12.5247 1.7022 17.1215 4.2407 3.5952 1.2625 17.2448 4.4252 50.0870
temp: 298.150 k
press: 1.00000 atm
elementType: 16 8 8 7 7 7 7 7 7 6 6 6 6 6 6 6 6 6 6 6 6 6 6 1 1 1 1 1 1 1 1 1 1
symmnumber: 1
zpe: 579393.8 jmol-1
zpe.correction: 0.220679 hartree
zpe.thermalcorrener: 0.242380 hartree
zpe.thermalcorrenthalpy: 0.243324 hartree
zpe.thermalcorrgfe: 0.165552 hartree
zpe.sumelectzpe: -1414.614927 hartree
zpe.sumelectthermal: -1414.593226 hartree
zpe.sumelectthermalent: -1414.592282 hartree
zpe.sumelectthermalfe: -1414.670055 hartree
dipole: -4.3213 1.8847 -3.9987
dipole: 6.1819
quadrupole: -151.6485 -148.2478 -144.8082
quadrupole: -32.6049 0.2712 13.4394
quadrupole: -3.4137 -0.0130 3.4266 -32.6049 0.2712 13.4394
hfenergy: -1414.8356067 hartree
pointgroup: C01 [X(C14H10N6O2S1)]
dipole: 1.2304775 -0.6531862 -1.9936251 debye
polarizability: 326.9937079|-11.3794377|239.0743923|-50.9406961|7.725732|166.721495 unknown
InChI: InChI=1S/C14H10N6O2S/c15-9-12(10-16)19-18-11-4-6-13(7-5-11)23(21,22)20-14-3-1-2-8-17-14/h1-8,12,20H
charge 0 multiplicity 1
33 atoms
S  2.927868 1.249086 0.31746
O  3.429502 2.702322 -0.219428
O  3.446849 0.647188 1.727375
N  3.381284 0.181237 -1.139603
N  2.500685 -1.7896 -0.197191
N  -3.14715 1.538433 0.313467
N  -3.822509 0.643369 0.962451
N  -6.465207 -1.116812 -0.434788
N  -6.316367 1.368095 3.267601
C  1.036205 1.256343 0.304319
C  0.417136 2.300375 -0.398434
C  0.354359 0.273417 1.044407
C  -0.992302 2.350934 -0.366564
C  -1.049549 0.337068 1.073794
C  3.393406 -1.219556 -1.059182
C  -1.717636 1.373893 0.361671
C  4.261097 -1.983344 -1.892691
C  4.165206 -3.386727 -1.839704
C  2.44519 -3.150192 -0.146948
C  3.243545 -3.99215 -0.950736
C  -5.326627 0.942992 0.825196
C  -5.970053 -0.20092 0.144064
C  -5.886941 1.162641 2.175627
H  4.110124 0.66828 -1.678562
H  1.016663 3.047641 -0.926875
H  0.917275 -0.511113 1.556373
H  -1.546187 3.134643 -0.891805
H  -1.63745 -0.396957 1.632093
H  4.977275 -1.4907 -2.55811
H  4.81256 -4.000759 -2.474361
H  1.728396 -3.570291 0.567297
H  3.152218 -5.078848 -0.874681
H  -5.466564 1.86041 0.214367
