program: Gaussian 09
title: 000281341
version: EM64L-G09RevD.01
frameworkgroup: C1[X(C12H9N7O2S2)]
method: RPBEPBE
basis: SDD
operation: Freq
keyword: #p
keyword: freq=noraman
keyword: PBEPBE/SDD
title: #p freq=noraman PBEPBE/SDD
converged: YES YES NO NO
title: Mulliken charges:
elementType: S S O O N N N N N N N C C C C C C C C C C C C H H H H H H H H H
charge: 1.035454 0.202123 -0.463492 -0.465838 -0.634028 -0.056243 -0.063785 -0.046560 -0.080810 0.037785 0.035606 -0.152090 -0.203014 -0.207323 -0.247751 -0.304347 0.161189 -0.009837 -0.041609 -0.705454 -0.148042 -0.122641 -0.120904 0.298529 0.301871 0.363924 0.295745 0.275956 0.267752 0.243554 0.243802 0.310476
chargesum: 0.00000
title: Mulliken charges with hydrogens summed into heavy atoms:
elementType: S S O O N N N N N N N C C C C C C C C C C C C
charge: 1.035454 0.202123 -0.463492 -0.465838 -0.270104 -0.056243 -0.063785 -0.046560 -0.080810 0.037785 0.035606 -0.152090 0.095515 0.094548 0.047994 -0.028391 0.161189 -0.009837 -0.041609 0.049654 0.162435 -0.122641 -0.120904
polarizability: 4.06110309e+02 2.25637232e+00 1.98906437e+02 -6.92463561e+00 1.06488873e-01 1.57411607e+02
1716.lowfreq: -111.9335 -3.3934 -0.0009 0.0005 0.0012 0.7284 2.8986 11.8196 18.9593
frequency: -111.9322 11.8019 18.9237 22.1954 36.5369 40.9065 58.5452 67.5017 70.8984 96.1342 114.3613 122.4940 137.1405 146.7461 175.0209 191.5285 204.4342 214.0365 244.5349 256.9252 303.8779 326.2997 329.0645 344.9791 360.4920 363.4545 400.6345 414.8909 422.1546 439.0267 482.2751 497.8824 520.8385 539.6806 550.8367 562.9390 577.0465 585.6234 592.3138 614.6678 666.4263 695.9406 733.9389 770.5049 796.3264 827.0234 857.8584 873.3580 901.8189 930.6446 943.0708 970.4171 989.2120 992.7456 1001.9205 1011.9448 1033.6647 1036.7762 1045.1898 1087.8079 1108.4396 1148.4590 1167.9031 1185.3656 1229.4010 1284.6037 1286.5550 1299.7816 1385.8749 1393.0956 1394.4508 1411.6699 1452.1805 1454.3541 1456.4177 1483.2578 1522.2256 1578.7452 1593.2592 2211.1313 2212.4578 2973.5939 2992.8531 3075.4178 3114.9548 3154.8044 3158.6182 3176.9358 3178.6218 3573.7394
redmass: 1.5819 9.8350 7.4985 6.2534 8.8980 11.5309 5.0998 9.2158 5.6521 9.0053 11.2474 1.6356 3.3250 2.8394 9.6350 9.6393 8.3781 10.1557 5.2829 10.6723 4.1007 8.3175 6.2420 9.6242 4.9452 8.4462 4.7014 4.6514 5.5549 11.2811 6.4197 6.9071 9.0036 7.2183 4.0784 12.3875 12.1468 5.7579 8.8488 7.3399 7.1823 9.0335 3.7897 10.1478 6.9910 14.3962 1.2364 1.5368 8.2959 2.9862 5.4639 16.8873 1.3790 4.8569 1.3781 3.6404 3.4267 1.3967 2.5291 2.6972 1.3060 1.7793 3.1289 1.5990 1.4446 1.3595 1.2634 1.7756 4.5356 9.4193 1.2257 5.9192 1.2622 1.0450 2.2005 6.5637 4.8606 6.5168 7.3774 12.6046 12.5927 1.0810 1.0365 1.0986 1.0987 1.0900 1.0897 1.0959 1.0975 1.0799
irintensity: 84.3257 1.9785 0.6298 0.4209 1.2622 0.4153 0.8826 7.6634 6.7981 2.4082 6.0243 2.4454 4.7184 0.4502 13.0451 3.6258 10.7611 2.1672 0.2009 7.6460 6.0467 19.7628 6.7234 21.0040 3.4358 1.0349 13.8628 47.1268 33.9583 139.8825 9.2108 17.3685 3.9194 0.8730 6.1476 2.8044 0.6482 153.6431 61.9532 4.5952 8.1339 4.2291 1.6262 36.6702 11.7713 81.7034 1.3814 48.5643 11.1898 36.2430 8.4028 76.0256 0.3687 12.3479 0.0422 20.0444 40.0507 2.9711 34.2463 34.4045 3.7620 24.0118 32.8606 19.7549 3.4114 2.1089 3.2302 118.8280 45.8386 20.6140 6.5291 25.3158 22.8099 21.2951 11.3743 461.9870 81.6313 12.5983 2.8794 1.0360 0.5666 7.4664 17.6831 11.3418 3.4173 4.3156 3.9978 1.7498 0.4748 61.9166
temp: 298.150 k
press: 1.00000 atm
elementType: 16 16 8 8 7 7 7 7 7 7 7 6 6 6 6 6 6 6 6 6 6 6 6 1 1 1 1 1 1 1 1 1
symmnumber: 1
zpe: 528064.0 jmol-1
zpe.correction: 0.201129 hartree
zpe.thermalcorrener: 0.224167 hartree
zpe.thermalcorrenthalpy: 0.225111 hartree
zpe.thermalcorrgfe: 0.143693 hartree
zpe.sumelectzpe: -1790.549314 hartree
zpe.sumelectthermal: -1790.526276 hartree
zpe.sumelectthermalent: -1790.525332 hartree
zpe.sumelectthermalfe: -1790.606750 hartree
dipole: 0.3200 4.6559 3.6493
dipole: 5.9243
quadrupole: -179.0975 -168.0637 -145.5827
quadrupole: -35.3505 13.2779 -3.0508
quadrupole: -14.8495 -3.8157 18.6652 -35.3505 13.2779 -3.0508
hfenergy: -1790.7504434 hartree
pointgroup: C01 [X(C12H9N7O2S2)]
dipole: -0.2144201 1.9402118 -1.2736575 debye
polarizability: 405.7437192|6.3115642|198.8052218|-9.9572189|3.0429572|157.8794116 unknown
InChI: InChI=1S/C12H9N7O2S2/c1-8-15-18-12(22-8)19-23(20,21)11-4-2-9(3-5-11)16-17-10(6-13)7-14/h2-5,10,19H,1H3
charge 0 multiplicity 1
32 atoms
S  2.220891 -1.596015 0.099367
S  4.874549 2.137337 0.072271
O  2.41741 -2.199724 1.585005
O  2.660875 -2.404683 -1.228702
N  2.870376 0.16098 0.028787
N  5.138998 -0.532389 0.285744
N  -3.669395 -0.192505 -0.642582
N  6.439723 -0.021273 0.36904
N  -4.377221 0.083736 0.404337
N  -7.43467 -1.35896 1.190964
N  -6.340929 2.929951 0.626466
C  0.393406 -1.108524 -0.096302
C  -0.350021 -0.860712 1.07379
C  -0.140986 -1.090862 -1.394111
C  -1.714553 -0.547253 0.931467
C  -1.510829 -0.777442 -1.525894
C  -2.285709 -0.500668 -0.371435
C  4.218424 0.419961 0.133381
C  6.533091 1.294004 0.283304
C  7.801219 2.086197 0.343281
C  -5.824326 0.391831 -0.020245
C  -6.723916 -0.564831 0.658702
C  -6.127342 1.790542 0.351727
H  0.125209 -0.93644 2.057406
H  0.483407 -1.337277 -2.25871
H  2.168152 0.892298 -0.096408
H  -2.343574 -0.344209 1.803046
H  -1.995823 -0.744399 -2.505982
H  8.643386 1.387467 0.472618
H  7.962649 2.665817 -0.583355
H  7.797565 2.795179 1.190613
H  -5.921232 0.275163 -1.120688
