program: Gaussian 09
title: 000281312
version: EM64L-G09RevD.01
frameworkgroup: C1[X(C5H9N5OS)]
method: RPBEPBE
basis: SDD
operation: Freq
keyword: #p
keyword: freq=noraman
keyword: PBEPBE/SDD
title: #p freq=noraman PBEPBE/SDD
converged: YES YES NO NO
title: Mulliken charges:
elementType: S O N N N N N C C C C C H H H H H H H H H
charge: 0.183815 -0.237115 -0.377881 0.082869 -0.086248 -0.440871 -0.497287 -0.341395 0.270172 -0.557968 -0.663359 0.082901 0.280028 0.282533 0.232709 0.232672 0.231494 0.344994 0.350756 0.319196 0.307984
chargesum: 0.00000
title: Mulliken charges with hydrogens summed into heavy atoms:
elementType: S O N N N N N C C C C C
charge: 0.183815 -0.237115 -0.032887 0.082869 -0.086248 -0.090116 0.129892 -0.341395 0.270172 0.004594 0.033517 0.082901
polarizability: 1.65096345e+02 1.01321297e+01 1.32222379e+02 -2.24960239e-01 -1.74210486e+00 5.66806689e+01
1716.lowfreq: -48.0547 -8.5713 -3.1736 -0.0017 0.0011 0.0022 7.6943 34.4756 52.4600
frequency: -48.0210 34.3768 52.4476 76.8898 98.9014 149.2485 175.7181 196.0825 236.3185 256.0761 274.3507 313.9933 403.4506 421.2256 441.6212 526.3763 533.8740 572.6851 620.9370 674.3126 679.1353 709.5192 721.8046 734.3232 779.5316 828.6408 961.2269 993.0843 1037.3150 1044.7595 1070.7152 1104.8619 1186.5578 1196.8202 1233.2146 1276.0665 1293.2447 1330.0086 1380.8086 1400.3342 1448.8326 1471.6903 1476.9019 1482.1861 1488.5303 1538.0561 1655.1484 1685.2513 2991.0283 3045.7291 3085.6759 3089.5657 3127.0371 3378.8522 3489.9722 3544.2872 3548.1433
redmass: 1.3396 3.5441 2.4333 3.9021 4.0793 3.5766 4.4699 6.3832 1.1002 5.6170 3.8301 8.2412 9.1444 7.2649 10.9575 1.4664 3.6718 6.3377 4.8582 2.7398 3.3090 5.3032 2.5011 10.4030 1.1119 1.9119 7.1227 1.8041 7.2090 1.2290 2.3752 5.4964 4.8510 7.9099 1.2286 1.2904 1.1814 2.1525 1.7345 1.2045 1.0884 1.0394 3.8687 1.0538 1.8057 10.6883 7.1579 1.0635 1.0357 1.0587 1.0978 1.1018 1.1082 1.0433 1.0975 1.0795 1.0797
irintensity: 27.5823 5.4282 13.6834 1.0960 2.0109 4.7962 4.5968 1.2536 0.2386 7.1648 0.9683 0.1552 0.8245 3.4165 3.3199 140.7617 39.3729 21.2071 4.2686 37.4122 27.6268 23.3054 97.9066 6.5778 10.8466 177.4988 27.3639 28.3355 116.4638 1.4906 27.8312 39.8667 39.2767 10.8788 0.6094 24.7937 5.4259 3.7737 24.6865 19.8048 11.1249 16.6770 63.9226 3.5898 136.6824 276.7910 608.0984 19.7227 27.2364 5.4002 20.1899 11.3646 22.4454 2.4328 5.2285 97.0242 29.8399
temp: 298.150 k
press: 1.00000 atm
elementType: 16 8 7 7 7 7 7 6 6 6 6 6 1 1 1 1 1 1 1 1 1
symmnumber: 1
zpe: 410126.2 jmol-1
zpe.correction: 0.156209 hartree
zpe.thermalcorrener: 0.168547 hartree
zpe.thermalcorrenthalpy: 0.169491 hartree
zpe.thermalcorrgfe: 0.116238 hartree
zpe.sumelectzpe: -942.012203 hartree
zpe.sumelectthermal: -941.999865 hartree
zpe.sumelectthermalent: -941.998920 hartree
zpe.sumelectthermalfe: -942.052173 hartree
dipole: 5.7240 0.7608 -0.1351
dipole: 5.7759
quadrupole: -86.2435 -76.5719 -77.4341
quadrupole: -11.9282 1.4031 -1.8085
quadrupole: -6.1604 3.5113 2.6491 -11.9282 1.4031 -1.8085
hfenergy: -942.1684114 hartree
pointgroup: C01 [X(C5H9N5O1S1)]
dipole: 2.2549455 -0.2043114 0.1932135 debye
dipolederiv: -0.7704965 0.0299843 -0.0366866 0.0082821 -0.1458423 -0.0019351 -0.0596008 0.0204775 -0.1096545 -1.368978 0.478502 -0.090413 0.4454435 -0.7200276 0.0464946 -0.0941738 0.0535514 -0.4016812 -0.0025845 0.3652754 -0.0144348 0.1014461 -0.9452666 0.1061656 -0.0693504 0.1216081 -0.4382336 0.0329688 -0.6580031 0.046673 0.2536544 0.0653067 0.0079087 -0.0278123 -0.0715189 -0.0927288 -0.7868326 0.57977 -0.0591925 0.3054509 -1.0700252 0.0649357 -0.0439074 0.0690818 -0.2944825 -1.0609415 0.6070333 -0.0861136 -0.3581532 -0.314339 -0.02855 -0.0309203 0.0588696 -0.2949813 -0.1437003 0.1086974 -0.0014143 0.01209 -0.5112053 -0.0664132 -0.0172195 -0.0497286 -0.0823931 0.8118252 -0.4010943 0.0968691 -0.6322453 -0.2711267 -0.0223137 0.1321646 0.0243153 -0.0030915 0.4091402 -0.385702 0.0292458 -0.0852826 1.3612256 -0.0862943 0.0348326 -0.059243 0.2583915 0.4368153 0.200812 -0.0210257 0.3721968 0.1927256 0.0067892 -0.0279518 -0.0154081 0.1477262 -0.1417033 0.0088075 -0.0072693 -0.1980812 0.0229486 -0.0007217 0.0212901 0.0056622 0.0666553 2.0520488 -0.6173934 0.1492586 -0.2655558 1.255445 -0.0673712 0.1206012 -0.1022612 0.312285 -0.0230218 0.0097904 -0.0472441 -0.0726039 -0.0022456 0.0724569 -0.0434796 0.0614162 -0.0403465 -0.020654 0.0164793 0.0413476 -0.0570708 -0.0401927 -0.0745923 0.0580213 -0.0591461 0.003428 0.0988554 0.0063832 -0.0108571 0.0827228 0.0630405 0.0948825 -0.0663417 0.0835573 -0.0833553 0.0955166 0.0127601 0.0151801 0.1012336 0.0111641 -0.1145969 0.0489804 -0.107429 -0.0283801 -0.0842913 -0.1006168 0.0073204 -0.1147344 -0.0389138 0.0185698 0.010838 0.0195798 0.1244605 0.1405158 -0.0829042 -0.004542 0.0028394 0.2764125 -0.0073521 0.0148973 -0.1052072 0.3383643 0.1235975 0.0028742 -0.0163614 -0.0484442 0.2273557 0.0037213 -0.0086237 0.007549 0.3433141 0.109836 -0.0401325 -0.0539632 0.0894058 0.2034431 0.1445954 0.0070894 0.1096264 0.1993443 0.0920842 -0.1413229 0.063623 0.0574058 0.3801175 -0.0963793 0.0406665 -0.0653525 0.0753595 unknown
polarizability: 165.4239035|-8.3879288|131.0369765|6.955933|-6.3177447|57.5385129 unknown
InChI: InChI=1S/C5H9N5OS/c1-2-12-4-3(8-6)7-5(11)10-9-4/h8,10H,2,6H2,1H3
charge 0 multiplicity 1
21 atoms
S  2.188945 -0.824152 0.211427
O  -3.168828 1.57485 -0.345937
N  -0.519578 -2.291179 0.039368
N  0.425959 1.253046 -0.067049
N  -1.89261 -0.41096 -0.148322
N  -0.852412 1.74423 -0.197668
N  -1.624455 -3.178469 -0.072094
C  0.540814 -0.068379 0.022306
C  -0.657528 -0.922226 -0.024673
C  3.297739 0.713403 0.032804
C  4.763436 0.271272 0.114721
C  -2.067163 0.977916 -0.235181
H  3.044985 1.1769 -0.933737
H  3.015703 1.404616 0.841925
H  4.992689 -0.205633 1.083708
H  5.022996 -0.435186 -0.693003
H  5.415131 1.158079 0.012017
H  0.402796 -2.72893 0.002538
H  -0.925843 2.761412 -0.26691
H  -2.263333 -2.833473 -0.805628
H  -2.130146 -3.225532 0.825889
