program: Gaussian 09
title: 000281319
version: EM64L-G09RevD.01
frameworkgroup: C1[X(C9H14N2O5)]
method: RPBEPBE
basis: SDD
operation: Freq
keyword: #p
keyword: freq=noraman
keyword: PBEPBE/SDD
title: #p freq=noraman PBEPBE/SDD
converged: YES YES NO NO
title: Mulliken charges:
elementType: O O O O O N N C C C C C C C C C H H H H H H H H H H H H H H
charge: -0.445947 -0.304351 -0.308363 -0.238188 -0.241267 -0.123210 -0.108802 -0.194714 -0.164518 -0.513291 -0.115440 -0.489434 0.303098 0.294066 -0.492208 -0.492670 0.314863 0.290430 0.255085 0.270126 0.247557 0.246406 0.237001 0.345739 0.245096 0.240740 0.229694 0.240266 0.227743 0.244496
chargesum: 0.00000
title: Mulliken charges with hydrogens summed into heavy atoms:
elementType: O O O O O N N C C C C C C C C C
charge: -0.100208 -0.304351 -0.308363 -0.238188 -0.241267 -0.123210 -0.108802 0.120149 0.125912 0.011919 0.132117 -0.006028 0.303098 0.294066 0.223321 0.219835
polarizability: 1.46367918e+02 -7.73890690e-01 1.33033688e+02 -1.31742393e-01 2.90104257e+00 9.54253799e+01
1716.lowfreq: -6.3335 -4.9748 0.0006 0.0008 0.0008 8.1574 58.3843 62.1967 74.9721
frequency: 58.3685 62.1879 74.9654 84.2855 91.0084 102.2635 127.0245 129.1274 141.7476 159.4215 182.7597 236.1067 260.5169 281.2180 297.6382 320.9318 361.4865 389.1235 408.6737 470.2933 493.0312 551.3610 604.7391 657.5138 681.2492 696.3085 725.7621 741.9494 802.8944 812.0640 836.3665 879.4943 909.2115 919.7577 939.5219 970.3921 980.9921 996.4956 1029.6270 1045.7351 1076.5366 1084.5372 1096.1208 1115.7739 1118.6905 1119.3938 1141.4237 1146.8938 1160.8142 1164.0889 1189.5805 1212.7047 1241.9211 1264.6016 1269.4028 1282.6034 1298.4300 1312.6906 1318.0210 1375.7739 1428.7391 1429.3349 1449.1812 1451.5000 1451.6365 1467.5820 1469.9685 1471.0887 1650.5600 1680.5723 3001.6082 3002.5577 3017.0639 3022.5237 3052.8408 3093.0867 3102.9091 3104.2179 3132.6851 3141.9280 3144.1400 3145.5280 3171.0993 3576.1395
redmass: 3.9050 4.3303 3.1612 2.4215 1.5769 1.4537 6.1910 3.7450 2.8556 3.6536 3.7649 1.1454 5.4312 4.1757 4.3300 4.8317 5.8045 4.7111 7.1405 2.4101 2.8113 5.0709 5.1516 4.8423 11.1332 10.1264 6.1014 4.9569 5.3892 3.8104 2.6125 2.2984 3.6885 3.3595 3.0837 1.9197 2.0125 5.6742 1.7312 3.5713 3.0663 3.2598 3.1639 1.5197 1.2770 1.2629 1.4714 1.4320 1.5021 1.4795 1.5552 1.4951 2.0430 1.4598 1.5766 1.4809 1.5425 3.6170 2.6237 1.5404 1.1838 1.1881 1.0856 1.0504 1.0547 1.1028 1.0529 1.0531 10.8966 11.1383 1.0294 1.0295 1.0713 1.0769 1.0601 1.1042 1.1047 1.1048 1.1081 1.1046 1.1046 1.0914 1.0921 1.0666
irintensity: 0.9756 7.6699 0.7478 0.7897 2.5636 0.1531 0.2639 3.0366 1.9378 5.9217 2.3956 150.4133 4.2087 25.1718 14.7161 18.8333 3.0844 8.2957 3.1956 3.4676 7.1619 2.4914 8.5064 9.2792 28.7776 1.3270 7.4424 2.3049 24.0594 5.3840 7.6901 5.2289 31.3019 3.9472 6.2481 28.1383 34.2347 43.7535 60.2329 93.8208 13.5845 303.7187 123.1505 92.9226 13.4770 2.3285 103.0946 20.0572 0.8712 17.8147 11.0833 33.7868 164.0008 38.1680 17.8606 32.1759 19.1269 164.5958 108.9960 5.9401 36.1587 52.3272 11.1314 9.6122 21.1993 11.0667 13.7113 10.4228 152.7514 430.9199 53.8343 40.7648 28.9725 22.9045 11.6884 19.8653 26.1393 26.9583 12.9147 17.7242 17.0168 7.1150 0.3057 6.8618
temp: 298.150 k
press: 1.00000 atm
elementType: 8 8 8 8 8 7 7 6 6 6 6 6 6 6 6 6 1 1 1 1 1 1 1 1 1 1 1 1 1 1
symmnumber: 1
zpe: 617046.4 jmol-1
zpe.correction: 0.235021 hartree
zpe.thermalcorrener: 0.251365 hartree
zpe.thermalcorrenthalpy: 0.252309 hartree
zpe.thermalcorrgfe: 0.190833 hartree
zpe.sumelectzpe: -835.687576 hartree
zpe.sumelectthermal: -835.671231 hartree
zpe.sumelectthermalent: -835.670287 hartree
zpe.sumelectthermalfe: -835.731763 hartree
dipole: -1.1986 3.8411 0.1706
dipole: 4.0273
quadrupole: -74.1445 -95.6566 -92.0014
quadrupole: -6.0696 0.7871 -3.5583
quadrupole: 13.1230 -8.3891 -4.7339 -6.0696 0.7871 -3.5583
hfenergy: -835.9225965 hartree
pointgroup: C01 [X(C9H14N2O5)]
dipole: -0.2765885 1.559701 0.0372511 debye
polarizability: 145.9219957|-2.4749305|133.5237436|1.3692689|2.2578614|95.3812473 unknown
InChI: InChI=1S/C9H14N2O5/c1-15-8(13)10-5-3-6(7(12)4-5)11(10)9(14)16-2/h5-7,12H,3-4H2,1-2H3
charge 0 multiplicity 1
30 atoms
O  1.12964 3.42467 -0.806527
O  2.753552 -1.113923 -0.197233
O  -2.932387 -0.458011 0.260277
O  0.971547 -2.445662 0.576794
O  -1.514873 -1.705726 -1.153171
N  0.664175 -0.194696 -0.099375
N  -0.684084 -0.155909 0.436291
C  1.196621 1.191347 0.105823
C  -0.87032 1.232628 1.002957
C  0.567697 1.542279 1.486448
C  0.423403 2.136367 -0.855861
C  -1.014934 2.199136 -0.214854
C  1.412493 -1.354675 0.159059
C  -1.676903 -0.849245 -0.25726
C  3.625189 -2.304365 -0.096777
C  -4.070685 -1.236769 -0.272229
H  2.28408 1.215372 -0.012706
H  -1.685673 1.241194 1.734673
H  0.703451 2.60271 1.747738
H  0.914028 0.889194 2.302565
H  0.41308 1.725612 -1.883232
H  -1.81957 1.877039 -0.896134
H  -1.229583 3.225338 0.134503
H  0.736343 4.037313 -1.476883
H  3.284745 -3.085832 -0.796748
H  3.613694 -2.708287 0.929648
H  4.626124 -1.939573 -0.368102
H  -4.097421 -1.184327 -1.373774
H  -4.961401 -0.767015 0.169328
H  -3.987431 -2.29258 0.036461
