program: Gaussian 09
title: 000281337
version: EM64L-G09RevD.01
frameworkgroup: C1[X(C12H12N6O2S2)]
method: RPBEPBE
basis: SDD
operation: Freq
keyword: #p
keyword: freq=noraman
keyword: PBEPBE/SDD
title: #p freq=noraman PBEPBE/SDD
converged: YES YES NO NO
title: Mulliken charges:
elementType: S S O O N N N N N N C C C C C C C C C C C C H H H H H H H H H H H H
charge: 0.941725 0.180293 -0.520263 -0.533662 -0.219985 -0.453634 -0.066990 -0.086593 0.032499 0.029772 -0.493026 -0.359291 -0.662334 -0.048774 -0.162970 -0.228510 -0.266610 -0.309942 0.157305 -0.146755 -0.124088 -0.121590 0.329724 0.249270 0.265157 0.293119 0.274380 0.262890 0.337289 0.284528 0.298777 0.288898 0.270663 0.308725
chargesum: 0.00000
title: Mulliken charges with hydrogens summed into heavy atoms:
elementType: S S O O N N N N N N C C C C C C C C C C C C
charge: 0.941725 0.180293 -0.520263 -0.533662 0.073134 -0.116345 -0.066990 -0.086593 0.032499 0.029772 -0.163302 0.155137 -0.125064 -0.048774 0.121558 0.070267 0.022289 -0.039279 0.157305 0.161971 -0.124088 -0.121590
polarizability: 3.51490737e+02 -7.04350123e+00 2.19679104e+02 -1.28481163e+01 5.70333200e+00 1.66699772e+02
1716.lowfreq: -7.4201 -2.9072 -1.0210 -0.0023 -0.0022 -0.0009 9.9791 15.8671 23.7622
frequency: 9.4689 15.8247 23.6156 36.3277 42.4517 60.4873 64.8544 90.6333 101.8023 111.7630 132.1972 142.3514 172.5844 178.0831 205.9070 209.6347 244.0942 253.7403 268.2885 321.7643 330.7754 351.8337 362.6450 377.9898 407.7226 418.0500 426.6923 436.6126 459.1682 495.0426 519.1209 551.7314 563.3713 578.1402 594.5747 615.8546 648.5140 666.5951 672.1500 723.7671 734.8660 792.6527 797.3743 810.4042 847.6103 861.6553 868.5384 898.0802 918.7676 919.8902 939.0535 943.3502 987.5680 993.5945 995.0204 997.2756 1011.5080 1025.8827 1046.5548 1107.3455 1110.5545 1149.6371 1150.4805 1174.7870 1187.2504 1203.0234 1227.1854 1257.0107 1263.1902 1284.7482 1287.4048 1336.9401 1372.7084 1381.4746 1396.4387 1407.3656 1438.2179 1451.2768 1457.4589 1457.9147 1578.7514 1593.7552 2210.5805 2212.3985 2970.9770 3034.6691 3040.8436 3059.0667 3103.6793 3124.5746 3159.3804 3164.8229 3177.0708 3181.9179 3370.2396 3483.6360
redmass: 7.7327 6.9533 5.0491 9.5035 5.4219 6.4461 10.2253 4.1782 8.1446 11.7706 4.7823 8.7100 9.9126 7.2858 8.8164 10.4649 5.0500 6.3575 4.0628 7.9047 8.5381 9.3887 8.4704 4.9858 3.5984 5.5363 6.7674 7.9087 5.0993 6.9524 3.3787 3.4562 12.3668 3.5493 7.9505 7.2899 2.7147 6.5159 3.6443 1.9453 3.6617 9.4001 2.1183 3.7371 1.2775 1.5880 1.5071 8.5400 3.0121 4.0424 9.0784 5.9394 1.3882 4.3530 1.4010 2.0804 3.6919 1.6391 2.5197 1.2845 1.2168 1.7273 1.7135 1.8705 1.6056 1.2489 1.5228 1.1899 1.1811 1.3593 1.2645 1.1736 1.4506 5.5252 10.2601 4.2981 1.2119 1.0899 1.6325 1.3230 6.6233 7.2824 12.6028 12.5961 1.0809 1.0569 1.0609 1.0876 1.1064 1.1088 1.0892 1.0884 1.0971 1.0977 1.0758 1.0759
irintensity: 2.0130 0.6851 0.3206 0.3708 1.6144 0.8258 3.3619 0.8356 2.4233 1.8951 2.8938 4.5202 0.7321 15.4779 4.8735 5.1268 4.6133 9.9434 6.5551 13.5921 6.7633 12.9905 1.5605 20.4287 8.4524 52.8336 23.3251 44.2980 49.5572 36.4072 1.3403 31.7437 2.1604 1.2539 29.5983 6.8312 7.5718 23.2730 73.6659 39.4912 1.6634 65.1227 70.4493 71.6170 2.1476 1.6339 42.1545 12.2192 0.6191 39.2076 57.8355 1.5162 0.9818 13.6951 0.2234 10.0651 19.3838 8.1945 19.8289 11.3772 9.5319 29.5645 26.7392 30.2928 18.3020 5.1337 6.1890 3.9912 11.9481 2.2045 3.2282 3.2492 27.2547 75.8621 15.4927 30.3103 13.7106 8.9402 4.1117 6.1372 23.8669 11.6436 1.8840 0.9900 8.3730 16.4397 30.4292 11.0727 6.7044 15.2329 3.8335 2.3298 1.5897 0.9998 41.2900 10.4629
temp: 298.150 k
press: 1.00000 atm
elementType: 16 16 8 8 7 7 7 7 7 7 6 6 6 6 6 6 6 6 6 6 6 6 1 1 1 1 1 1 1 1 1 1 1 1
symmnumber: 1
zpe: 615147.6 jmol-1
zpe.correction: 0.234297 hartree
zpe.thermalcorrener: 0.256757 hartree
zpe.thermalcorrenthalpy: 0.257702 hartree
zpe.thermalcorrgfe: 0.177620 hartree
zpe.sumelectzpe: -1737.671085 hartree
zpe.sumelectthermal: -1737.648625 hartree
zpe.sumelectthermalent: -1737.647681 hartree
zpe.sumelectthermalfe: -1737.727762 hartree
dipole: 1.9369 3.3882 -1.8858
dipole: 4.3345
quadrupole: -181.0210 -157.0471 -141.7252
quadrupole: 25.8827 16.1953 10.5460
quadrupole: -21.0899 2.8840 18.2059 25.8827 16.1953 10.5460
hfenergy: -1737.9053823 hartree
pointgroup: C01 [X(C12H12N6O2S2)]
dipole: 0.5528906 1.2584611 -1.0092994 debye
polarizability: 350.3865307|8.747433|219.8060067|-17.960808|-6.6583479|167.6770753 unknown
InChI: InChI=1S/C12H12N6O2S2/c13-7-10(8-14)17-16-9-1-3-11(4-2-9)22(19,20)18-12-15-5-6-21-12/h1-4,10,12,15,18H,5-6H2
charge 0 multiplicity 1
34 atoms
S  3.098763 -1.380672 0.413015
S  5.265456 2.404919 -0.797451
O  3.398507 -1.216382 2.009012
O  3.596871 -2.675889 -0.44288
N  2.99305 2.016541 0.733849
N  3.771849 0.15598 -0.538953
N  -2.911014 -1.016692 -0.489824
N  -3.619564 -0.271051 0.297818
N  -6.531335 -1.235388 1.92714
N  -5.813534 2.110195 -0.93723
C  4.150673 1.252708 0.369221
C  2.535388 2.808725 -0.430658
C  3.765833 3.537928 -1.066272
C  1.231293 -1.226208 0.162249
C  0.495544 -0.451629 1.079229
C  0.665945 -1.924686 -0.915222
C  -0.894853 -0.3577 0.895006
C  -0.730457 -1.828182 -1.090333
C  -1.501948 -1.042652 -0.196138
C  -5.096176 -0.332907 -0.134444
C  -5.901011 -0.815829 1.007554
C  -5.510548 1.020061 -0.564335
H  4.746847 0.958355 1.249426
H  1.756952 3.525025 -0.119509
H  2.109029 2.111548 -1.169439
H  3.131904 2.566139 1.590464
H  3.62802 3.692599 -2.147166
H  3.982086 4.498039 -0.569687
H  4.578277 -0.224384 -1.073585
H  1.007465 0.053249 1.903163
H  1.29572 -2.53253 -1.572063
H  -1.518519 0.230156 1.574675
H  -1.239914 -2.347698 -1.90745
H  -5.203201 -1.037088 -0.987178
