program: Gaussian 09
title: 000025475
version: EM64L-G09RevD.01
frameworkgroup: C1[X(C18H5Cl9)]
method: RPBEPBE
basis: SDD
operation: Freq
keyword: #pfreq=noraman
keyword: PBEPBE/SDD
title: #p freq=noraman PBEPBE/SDD
converged: YES YES NO NO
title: Mulliken charges:
elementType: Cl Cl Cl Cl Cl Cl Cl Cl Cl C C C C C C C C C C C C C C C C C C H H H H H
charge: 0.036710 -0.003720 0.039518 0.029264 0.003217 0.002257 0.009572 -0.027156 0.051655 0.500177 0.436896 0.336654 0.443302 -0.282178 -0.338017 -0.337369 -0.381771 -0.351297 -0.346810 -0.308292 -0.357047 -0.044303 -0.043203 -0.055505 -0.091480 -0.107154 -0.226112 0.284970 0.277042 0.278957 0.281621 0.289601
chargesum: 0.00000
title: Mulliken charges with hydrogens summed into heavy atoms:
elementType: Cl Cl Cl Cl Cl Cl Cl Cl Cl C C C C C C C C C C C C C C C C C C
charge: 0.036710 -0.003720 0.039518 0.029264 0.003217 0.002257 0.009572 -0.027156 0.051655 0.500177 0.436896 0.336654 0.443302 -0.282178 -0.338017 -0.337369 -0.096802 -0.074255 -0.067853 -0.308292 -0.075426 -0.044303 -0.043203 -0.055505 -0.091480 -0.107154 0.063490
polarizability: 4.20379429e+02 -6.86414257e+00 2.78536994e+02 -6.48074621e+00 4.62686767e+00 1.83982893e+02
1716.lowfreq: -2.0506 -0.0020 -0.0011 0.0014 1.5678 2.7762 5.9171 14.8001 16.2858
frequency: 2.0755 14.7778 16.2605 27.5537 46.5801 49.6416 74.7371 75.9990 83.9568 98.3642 113.7915 147.1350 154.1919 179.1777 186.7806 191.5997 195.4349 197.1658 201.4092 205.2892 216.9775 219.6156 272.8591 288.7020 310.3731 313.2545 319.9477 327.6875 333.0697 347.8990 389.8130 427.9088 434.0207 471.7821 473.8743 510.6441 512.1610 522.9260 532.7946 541.8932 557.3654 569.6242 601.8809 645.9340 675.0556 683.6666 704.6429 727.9861 743.7944 772.6047 775.7885 781.1220 808.6920 869.0103 880.1112 882.9851 891.6846 894.1319 899.4233 1002.8117 1013.6443 1044.3434 1103.4128 1114.3356 1140.3065 1149.2917 1186.1871 1193.9464 1239.1669 1289.8139 1316.1743 1342.1136 1343.4992 1352.8244 1372.1391 1374.3963 1400.4694 1424.0462 1466.1830 1516.7520 1544.6357 1552.6279 1579.9473 1588.9477 1598.7789 3173.0087 3173.3389 3173.7594 3175.6476 3185.7921
redmass: 20.8956 25.4458 20.5022 19.3190 19.9291 21.5183 28.5421 27.1074 26.1289 17.5670 21.8897 31.0824 10.2096 12.5460 20.4871 5.7314 16.1823 14.6692 14.1303 20.0772 8.8447 7.8876 7.9063 20.5332 9.3397 25.7767 22.6013 7.7640 28.8799 10.5283 10.8727 9.4351 9.5122 7.3166 7.5922 5.2779 6.5781 8.9931 6.9581 5.1929 7.3799 8.6931 5.9328 8.3059 8.5362 9.5902 3.4893 4.8807 7.6843 10.3265 10.0548 8.7119 10.2474 1.4364 1.4483 1.5841 1.3636 1.4794 8.1293 8.2201 7.1044 6.4745 2.7440 2.3943 2.0762 2.5102 1.7779 1.6230 2.3396 3.3326 5.3110 5.6365 8.1049 9.3218 4.2290 3.4178 3.0438 4.4433 7.4059 9.3067 8.9234 7.4117 8.7613 7.7322 8.6331 1.0933 1.0928 1.0933 1.0939 1.0937
irintensity: 0.0178 0.0064 0.0358 0.0406 0.0184 0.0064 0.0387 0.0799 0.0499 0.0635 0.0679 0.0713 0.0626 0.0481 0.1587 0.1604 0.0213 0.3004 0.1820 0.1338 0.4176 0.6379 0.6428 0.3273 2.5972 0.3458 0.1366 0.6528 0.2182 0.2572 7.4264 15.1737 13.0011 7.2271 3.2089 0.0258 5.0425 26.7089 9.9435 5.3549 4.9724 17.4824 11.7336 16.5375 4.5152 11.0746 18.5679 3.2155 30.6079 82.1152 45.7593 15.2075 1.9613 26.2222 13.8823 8.9031 0.2571 4.3808 8.6834 4.1688 77.7017 39.7833 31.3321 18.2199 11.2139 32.7882 8.0491 12.1887 18.2575 1.2417 68.8120 15.4057 26.0538 6.0445 29.7753 88.1020 168.8748 21.7957 5.8345 24.8722 74.1172 55.7149 34.6470 25.6455 6.8805 0.2334 0.3683 0.2618 0.0843 2.3587
temp: 298.150 k
press: 1.00000 atm
elementType: 17 17 17 17 17 17 17 17 17 6 6 6 6 6 6 6 6 6 6 6 6 6 6 6 6 6 6 1 1 1 1 1
symmnumber: 1
zpe: 445776.3 jmol-1
zpe.correction: 0.169787 hartree
zpe.thermalcorrener: 0.195926 hartree
zpe.thermalcorrenthalpy: 0.196870 hartree
zpe.thermalcorrgfe: 0.106163 hartree
zpe.sumelectzpe: -4827.578761 hartree
zpe.sumelectthermal: -4827.552622 hartree
zpe.sumelectthermalent: -4827.551678 hartree
zpe.sumelectthermalfe: -4827.642386 hartree
dipole: -2.6914 1.3625 -0.6566
dipole: 3.0873
quadrupole: -229.0331 -217.7418 -219.2448
quadrupole: -3.6824 2.4948 0.3300
quadrupole: -7.0265 4.2648 2.7617 -3.6824 2.4948 0.3300
hfenergy: -4827.7485485 hartree
pointgroup: C01 [X(C18H5Cl9)]
dipole: -1.0690405 -0.4211626 0.3937926 debye
polarizability: 420.476801|6.6803225|272.6918604|6.306301|-22.8513748|189.7306552 unknown
InChI: InChI=1S/C18H5Cl9/c19-7-3-8(15(24)13(23)4-7)9-5-10(20)14(18(27)16(9)25)6-1-11(21)17(26)12(22)2-6/h1-5H
charge 0 multiplicity 1
32 atoms
Cl 1.374215 0.246713 -2.703119
Cl 1.338355 -0.415666 2.832473
Cl -1.846915 0.190653 -2.704041
Cl -3.127226 2.637552 -0.21439
Cl 5.641257 2.819001 0.008885
Cl 5.754251 -2.782851 0.146808
Cl -6.377827 2.440386 -0.098232
Cl -6.027785 -3.032787 0.606905
Cl 7.358211 0.051236 0.087264
C  1.220083 -0.071071 0.056072
C  -1.6608 -0.101323 0.060133
C  2.717766 -0.042464 0.058489
C  -3.15772 -0.136513 0.104371
C  0.474172 0.067182 -1.145846
C  0.47129 -0.236607 1.246765
C  -0.938949 0.049326 -1.150522
C  -0.933949 -0.254792 1.263712
C  3.452094 -1.249982 0.095619
C  3.402901 1.194064 0.030779
C  -3.943451 1.039778 -0.012653
C  -3.806114 -1.380777 0.301332
C  4.80982 1.213363 0.04138
C  4.858753 -1.212075 0.102623
C  -5.352532 0.960401 0.04888
C  -5.210092 -1.43126 0.360795
C  5.561689 0.015332 0.076331
C  -6.002604 -0.276932 0.233945
H  -1.471335 -0.369501 2.208623
H  2.939956 -2.21542 0.117469
H  2.851762 2.13763 0.002275
H  -3.211413 -2.293631 0.390988
H  -7.093065 -0.326462 0.279387
