program: Gaussian 09
title: 000281295
version: EM64L-G09RevD.01
frameworkgroup: C1[X(C12H10O3S)]
method: RPBEPBE
basis: SDD
operation: Freq
keyword: #p
keyword: freq=noraman
keyword: PBEPBE/SDD
title: #p freq=noraman PBEPBE/SDD
converged: NO YES NO NO
title: Mulliken charges:
elementType: S O O O C C C C C C C C C C C C H H H H H H H H H H
charge: 0.211832 -0.227004 -0.206655 -0.212818 0.304772 0.268325 -0.092885 0.290279 0.015570 -0.501327 -0.358127 -0.364747 -0.229810 -0.218305 -0.539467 -0.834733 0.282814 0.285805 0.291031 0.242049 0.242083 0.273238 0.283804 0.280203 0.258403 0.255669
chargesum: 0.00000
title: Mulliken charges with hydrogens summed into heavy atoms:
elementType: S O O O C C C C C C C C C C C C
charge: 0.211832 -0.227004 -0.206655 -0.212818 0.304772 0.268325 -0.092885 0.290279 0.015570 -0.218513 -0.072322 -0.073716 0.012240 0.023779 0.017575 -0.040458
polarizability: 2.52517743e+02 -7.10603462e+00 1.70851883e+02 -2.27654549e+00 1.76986841e+00 7.88208984e+01
1716.lowfreq: -11.5872 -6.7474 -0.0022 0.0006 0.0010 5.3465 6.4837 33.1742 71.8651
frequency: -7.7248 33.1437 71.8636 87.4298 104.8346 121.0631 123.3618 156.6606 199.6020 209.1437 265.6905 282.1822 319.8782 365.8182 382.2451 430.8346 432.3371 454.0823 484.9403 511.7539 622.2498 649.2406 664.9916 666.1316 698.7336 718.5706 745.3629 780.0507 791.6545 823.4407 835.3146 881.3836 891.7794 927.7514 956.6399 971.0871 995.5726 1005.7524 1014.1826 1031.8307 1072.6224 1120.6531 1168.0463 1179.9187 1188.4727 1222.0933 1262.9068 1281.6260 1312.3507 1330.6673 1343.3840 1400.2890 1407.2428 1440.6293 1448.1127 1461.9144 1470.2772 1522.5189 1542.9564 1572.1571 1607.1723 1608.2262 3011.7673 3053.4160 3130.6412 3138.7476 3143.6895 3147.4380 3151.9992 3162.0443 3172.5358 3173.2391
redmass: 6.4085 3.4669 6.8220 2.8230 1.3348 4.0172 4.2025 8.5214 4.9127 4.3290 5.9940 3.2442 8.2951 11.0343 4.2203 4.3771 10.7227 8.7087 3.8488 9.4718 6.2424 6.2600 6.6201 3.5916 6.9615 3.5495 6.3991 6.7190 1.5043 3.0936 5.9531 1.3564 1.4976 1.6191 6.8130 1.1955 1.3951 1.3575 1.3606 2.1806 3.1327 1.8248 1.4613 1.8532 1.0612 1.8688 1.7564 1.2157 4.0887 2.8338 1.1586 9.4909 1.0842 2.5200 1.0534 1.0535 2.7724 10.7077 9.9081 7.4114 6.9870 7.5749 1.0290 1.0543 1.1046 1.0862 1.1044 1.1119 1.0900 1.0948 1.0967 1.0957
irintensity: 1.7161 1.6113 4.5469 1.3620 0.7246 0.7301 1.6576 5.9611 1.3870 3.7773 0.5212 1.0492 2.8949 24.7089 0.0109 2.8070 2.4845 1.4528 1.2104 8.1054 8.6560 4.3121 0.4714 3.5630 22.4279 23.9028 142.4705 26.0199 72.8874 1.4742 46.9200 4.6866 22.1804 1.8764 214.5534 18.4472 3.1218 22.8536 0.0933 3.0592 18.4018 22.2833 234.4060 251.3265 5.4503 3.6716 75.9734 5.1594 131.7954 52.4398 6.9313 0.2596 24.9376 0.3565 15.1949 18.4625 0.6038 36.2959 338.2292 188.5904 17.4757 71.5741 25.4244 7.3884 15.7839 3.6426 8.8635 5.1497 3.3709 1.7478 19.8683 8.1474
temp: 298.150 k
press: 1.00000 atm
elementType: 16 8 8 8 6 6 6 6 6 6 6 6 6 6 6 6 1 1 1 1 1 1 1 1 1 1
symmnumber: 1
zpe: 496201.1 jmol-1
zpe.correction: 0.188993 hartree
zpe.thermalcorrener: 0.203120 hartree
zpe.thermalcorrenthalpy: 0.204065 hartree
zpe.thermalcorrgfe: 0.146938 hartree
zpe.sumelectzpe: -1085.846376 hartree
zpe.sumelectthermal: -1085.832249 hartree
zpe.sumelectthermalent: -1085.831305 hartree
zpe.sumelectthermalfe: -1085.888432 hartree
dipole: -0.8900 -2.6058 1.7012
dipole: 3.2367
quadrupole: -84.2622 -109.6254 -99.9597
quadrupole: 11.9143 6.7544 1.0632
quadrupole: 13.6869 -11.6762 -2.0106 11.9143 6.7544 1.0632
hfenergy: -1086.0353695 hartree
pointgroup: C01 [X(C12H10O3S1)]
dipole: 0.380604 -1.2124037 -0.0822472 debye
dipolederiv: -0.4449155 -0.0814384 -0.0634859 0.0551622 -0.1210625 0.0643721 -0.1295065 0.0431994 -0.0196806 -2.2073175 -0.4848342 0.3907368 -0.4458076 -0.3286664 0.0433397 0.4748326 0.0870786 -0.3275576 -0.9071717 -0.0581819 0.0793265 -0.3386961 -0.6596155 0.2417377 0.2522598 0.2099337 -0.4207439 -0.739561 -0.1474852 0.1150964 -0.1829613 -0.7849563 0.2611222 0.1538176 0.2712053 -0.4814588 -0.7820196 0.0051626 0.0786153 0.0129735 -0.0004282 0.0023283 0.0878392 0.0006815 -0.0068531 -0.1359888 0.1699872 -0.0751727 0.3413552 -0.2181753 0.0967214 -0.1647722 0.1126514 -0.0198228 1.2973025 -0.1854346 -0.0159888 0.2487678 0.8025658 -0.3656395 -0.266822 -0.3236501 0.3615073 1.6586894 0.509602 -0.3992992 0.4001211 -0.1695733 0.1226054 -0.4052438 0.100362 0.1184319 1.6383121 0.1111778 -0.2028412 -0.1322042 0.7440176 -0.3107946 -0.1155973 -0.3402085 0.3416266 -1.1532208 -0.2366274 0.2000093 -0.4904455 -0.0930139 0.0048996 0.3745896 -0.0121643 -0.1997727 -0.0316389 0.1711883 -0.1040422 -0.0645416 0.0041159 -0.0504585 0.0261536 -0.0764721 -0.0587721 -0.2149511 0.0533293 -0.0183657 0.2050474 0.0079939 -0.0822239 -0.0988538 -0.0661847 -0.0560666 0.0152936 -0.1942391 0.0873469 -0.1084915 0.0089136 -0.0722722 0.0406611 -0.0629968 -0.117793 0.2364955 0.0148018 -0.0506307 -0.0730379 -0.0271805 -0.0496639 -0.0029422 -0.0588183 -0.0984191 1.6965899 0.2412241 -0.1840059 0.592416 0.4148056 -0.1008925 -0.4196837 -0.1246151 0.2462724 -0.0307624 0.0245351 0.1214971 0.0737644 0.0609104 -0.0147182 0.0998204 0.0433079 0.1140615 0.0214208 0.0396557 -0.0041159 0.0722038 0.0734571 0.0438065 -0.0179035 0.0488785 0.1418907 0.1020797 -0.0681994 0.0446784 -0.0093384 0.0541786 0.0544342 0.0108695 0.0616621 0.1176187 0.1232235 0.0043174 0.0021465 -0.0665626 0.0512754 0.06412 0.0405059 0.0563757 0.1205655 0.0052048 0.0874602 -0.0305059 0.103642 0.0081794 0.070782 -0.0383526 0.0721914 0.1239322 -0.1116333 -0.0000193 0.0304389 -0.0044539 0.1086547 0.0263201 0.0334658 0.0258567 0.1377562 -0.1064208 0.0206851 0.0372908 -0.0732024 -0.0453957 -0.0311187 0.1172309 -0.0669073 0.0140404 -0.0441224 -0.0207661 -0.0553244 -0.0878708 0.0599255 0.0191276 0.0113713 0.0254629 -0.0163596 0.0907203 -0.0764774 0.0632504 -0.0770439 0.0360467 0.0467046 0.0397426 0.0505469 -0.0621323 -0.0990944 0.0490969 -0.0457965 0.0524537 0.1169562 -0.0006592 -0.0584212 -0.0082844 0.0810942 0.1234859 0.0514794 -0.0008581 -0.0032492 -0.1039291 -0.0839802 -0.0450613 -0.0690923 -0.0333655 unknown
polarizability: 250.9677537|5.3623927|146.0530846|-13.8604939|-41.636614|105.1696863 unknown
InChI: InChI=1S/C12H10O3S/c1-16-7-15-11-6-10(13)8-4-2-3-5-9(8)12(11)14/h2-6H,7H2,1H3
charge 0 multiplicity 1
26 atoms
S  -4.924501 -0.209785 1.037699
O  -2.37499 0.377706 0.332186
O  -0.626306 -1.759024 1.26357
O  1.449852 2.609993 -1.363576
C  1.337479 -0.628289 0.423063
C  1.882281 0.498536 -0.255857
C  -0.129171 -0.752744 0.662584
C  -1.002337 0.370095 0.161839
C  0.980914 1.594933 -0.746207
C  -0.45445 1.455112 -0.494889
C  2.196566 -1.657781 0.883447
C  3.276274 0.585015 -0.467285
C  3.586984 -1.565134 0.669573
C  4.127475 -0.442899 -0.006365
C  -3.1465 -0.716709 1.011824
C  -5.320132 -0.423182 -0.793442
H  -1.105715 2.259985 -0.849013
H  1.754846 -2.514247 1.402619
H  3.665535 1.463484 -0.991699
H  4.249487 -2.360588 1.02621
H  5.207962 -0.372957 -0.17098
H  -3.007697 -1.655949 0.456562
H  -2.816681 -0.832451 2.053871
H  -4.671002 0.235866 -1.38821
H  -6.372086 -0.125717 -0.920083
H  -5.192087 -1.47547 -1.093137
