program: Gaussian 09
title: 000281324
version: EM64L-G09RevD.01
frameworkgroup: C1[X(C17H18N2O2)]
method: RPBEPBE
basis: SDD
operation: Freq
keyword: #p
keyword: freq=noraman
keyword: PBEPBE/SDD
title: #p freq=noraman PBEPBE/SDD
converged: YES YES NO NO
title: Mulliken charges:
elementType: O O N N C C C C C C C C C C C C C C C C C H H H H H H H H H H H H H H H H H H
charge: -0.466075 -0.271296 -0.488767 -0.453844 0.191058 0.121160 0.146190 0.213357 -0.575783 0.255381 -0.417063 -0.365576 -0.322018 -0.349504 0.320894 -0.049373 -0.342925 -0.253439 -0.216933 -0.502110 -0.693661 0.251296 0.225024 0.318941 0.232351 0.234970 0.211003 0.241287 0.401776 0.238314 0.238697 0.224392 0.225406 0.195452 0.231993 0.213438 0.262045 0.208102 0.365841
chargesum: 0.00000
title: Mulliken charges with hydrogens summed into heavy atoms:
elementType: O O N N C C C C C C C C C C C C C C C C C
charge: -0.100234 -0.271296 -0.169827 -0.052068 0.191058 0.121160 0.146190 0.213357 -0.099463 0.255381 -0.184713 -0.130606 0.130272 -0.111190 0.320894 -0.049373 -0.104228 -0.029047 0.008473 -0.074664 -0.010077
polarizability: 3.79992535e+02 -1.86849863e+00 2.02317393e+02 4.14817766e+00 1.19615231e+01 1.15436756e+02
1716.lowfreq: -0.0005 -0.0004 0.0006 0.7351 5.7635 11.1959 36.1645 47.9615 65.1131
frequency: 36.1597 47.9517 65.1114 69.7695 81.3759 109.4158 119.3400 124.7481 174.7244 184.0337 201.8764 210.5476 238.8311 257.1133 264.8672 297.4216 316.7982 342.2603 384.7313 398.0211 439.2882 457.6547 470.9274 489.6334 534.1897 548.7735 550.9777 562.3528 571.8977 602.0735 632.5282 642.4792 696.9912 701.3186 723.4798 751.9497 760.5719 763.5823 782.5532 789.4574 809.8728 839.3963 851.9979 882.3094 919.1907 927.0621 934.1146 935.3080 968.9235 973.7819 983.6739 1007.9384 1021.8906 1044.9519 1047.6155 1066.2394 1075.9428 1114.4083 1122.3613 1152.4058 1158.7797 1170.2954 1186.0713 1209.9662 1236.8551 1247.6959 1249.1485 1252.6108 1306.4457 1316.4413 1324.4307 1330.9459 1342.7785 1358.3097 1366.7724 1380.8446 1389.7016 1414.1007 1433.7244 1452.8741 1459.1806 1463.6340 1469.3231 1471.7064 1473.9711 1484.1406 1491.3424 1539.3474 1567.1172 1584.2680 1614.4102 1629.2801 1633.4481 2982.2586 2987.6200 2989.3954 2995.5481 3044.6866 3054.0275 3076.8778 3094.3349 3098.6776 3120.2187 3124.7136 3132.3498 3146.2871 3152.6199 3164.6128 3168.1763 3566.3454 3598.8457
redmass: 4.5050 3.9059 5.2583 3.4297 4.2700 3.2926 2.9580 4.7129 4.4425 3.3361 4.0376 1.5201 3.6026 5.0904 3.8626 2.3736 4.1342 1.8661 1.8345 3.6649 3.3321 4.1584 3.4972 4.4277 4.5161 1.5566 3.2876 5.0058 2.7792 4.0930 5.8434 5.0200 4.4826 3.8141 4.0111 1.4539 3.3675 3.8198 2.3628 1.9382 1.3989 2.7816 1.5186 5.0642 1.8891 2.9808 1.3952 1.3795 2.6813 1.3056 2.1904 2.1339 2.0976 2.1265 1.6214 1.7727 2.2737 1.8038 1.6608 1.5642 1.4472 1.1209 2.1607 1.5714 2.4937 1.5634 1.4329 1.6093 2.9164 1.5311 1.4044 1.2198 1.6469 1.5718 1.6139 1.2248 2.5282 3.3471 2.5138 1.6453 2.0775 1.0994 1.1202 1.0568 3.3037 3.1269 1.0723 5.6592 7.2135 6.1664 3.9868 5.3221 5.3085 1.0355 1.0586 1.0620 1.0654 1.1017 1.0986 1.1003 1.1026 1.1009 1.0903 1.0856 1.0888 1.0950 1.0856 1.1000 1.0941 1.0659 1.0804
irintensity: 0.3578 2.0731 1.5501 5.1182 2.3003 0.8726 13.7223 5.4753 1.2088 5.5212 5.6111 3.0946 3.4834 2.0815 1.8437 0.6771 5.0256 90.1364 115.5686 0.6647 17.9977 3.1951 19.7650 5.9623 0.6779 64.8344 9.0114 7.6953 13.0840 6.3059 1.8354 2.3320 9.1525 5.7176 2.1815 97.2490 16.5978 1.1505 4.1642 7.8259 34.1401 6.5406 0.6915 2.8352 10.3904 4.8538 1.9591 6.1459 12.5363 0.1287 14.5562 16.6812 34.5310 30.4720 46.9192 16.6173 8.1347 4.1571 5.1091 14.4653 24.9402 5.5576 22.6544 2.8626 2.7715 26.7003 2.2897 6.3771 10.2307 1.5245 17.2441 0.9087 18.5349 33.9304 10.8517 26.0892 23.7798 28.7848 6.3657 14.1806 6.6538 12.7535 10.9981 14.4874 34.8688 4.9128 8.4397 29.1676 35.4056 2.4667 132.8355 104.9628 261.6828 55.4137 47.4716 21.0432 64.4026 12.3974 20.4620 56.3040 28.2608 25.3174 37.3371 2.6329 1.2431 21.4419 478.6055 40.2923 7.4595 8.7609 46.6625
temp: 298.150 k
press: 1.00000 atm
elementType: 8 8 7 7 6 6 6 6 6 6 6 6 6 6 6 6 6 6 6 6 6 1 1 1 1 1 1 1 1 1 1 1 1 1 1 1 1 1 1
symmnumber: 1
zpe: 828920.7 jmol-1
zpe.correction: 0.315719 hartree
zpe.thermalcorrener: 0.334569 hartree
zpe.thermalcorrenthalpy: 0.335514 hartree
zpe.thermalcorrgfe: 0.268559 hartree
zpe.sumelectzpe: -917.087155 hartree
zpe.sumelectthermal: -917.068305 hartree
zpe.sumelectthermalent: -917.067361 hartree
zpe.sumelectthermalfe: -917.134315 hartree
dipole: 4.7543 -3.2745 0.5102
dipole: 5.7953
quadrupole: -127.9259 -114.3704 -125.7236
quadrupole: 15.0543 -6.0833 9.0426
quadrupole: -5.2526 8.3029 -3.0503 15.0543 -6.0833 9.0426
hfenergy: -917.4028747 hartree
pointgroup: C01 [X(C17H18N2O2)]
dipole: -1.7846952 -1.3474352 -0.444911 debye
polarizability: 379.0452613|12.1571029|204.5919963|6.7236063|4.4548729|114.1094262 unknown
InChI: InChI=1S/C17H18N2O2/c1-2-11-7-8-15(19-17(11)21)16-13(9-10-20)12-5-3-4-6-14(12)18-16/h3-8,18-20H,2,9-10H2,1H3
charge 0 multiplicity 1
39 atoms
O  -0.188816 2.484021 1.546644
O  3.646002 1.773665 0.911671
N  -1.268457 -1.539904 0.04488
N  1.671965 0.637065 0.384248
C  -1.388308 0.694669 -0.447344
C  -0.508319 -0.368897 -0.162101
C  -2.732834 0.15167 -0.399263
C  -2.627881 -1.24979 -0.082712
C  -1.013131 2.116608 -0.785434
C  0.95981 -0.440966 -0.127213
C  -4.021078 0.71699 -0.603706
C  -3.76091 -2.082031 0.050956
C  -1.016994 3.047143 0.456901
C  1.666943 -1.556199 -0.586754
C  3.81661 -0.463931 -0.038849
C  3.094376 0.724782 0.443408
C  3.09759 -1.554262 -0.521861
C  -5.153998 -0.108434 -0.475916
C  -5.025344 -1.492097 -0.148561
C  5.328214 -0.41995 0.012415
C  5.934396 0.496579 -1.085847
H  -0.00943 2.147363 -1.246871
H  -1.71974 2.531387 -1.530631
H  -0.870795 -2.427788 0.345902
H  -4.133735 1.776688 -0.860141
H  -3.668356 -3.146108 0.294564
H  -2.049289 3.217819 0.820325
H  -0.55516 4.018409 0.217705
H  1.148629 1.43464 0.813115
H  1.129524 -2.390135 -1.04528
H  3.644412 -2.435215 -0.880728
H  -6.154018 0.311705 -0.629407
H  -5.927304 -2.106858 -0.054911
H  5.734883 -1.444456 -0.087688
H  5.639458 -0.024058 0.997908
H  7.037092 0.514083 -1.009516
H  5.563617 1.528076 -0.962607
H  5.663073 0.140322 -2.096412
H  -0.725196 1.812097 2.039212
