program: Gaussian 09
title: 000281307
version: EM64L-G09RevD.01
frameworkgroup: C1[X(C10H11N5OS)]
method: RPBEPBE
basis: SDD
operation: Freq
keyword: #p
keyword: freq=noraman
keyword: PBEPBE/SDD
title: #p freq=noraman PBEPBE/SDD
converged: YES YES NO NO
title: Mulliken charges:
elementType: S O N N N N N C C C C C C C C C C H H H H H H H H H H H
charge: 0.189153 -0.239030 0.084888 -0.367578 -0.131099 -0.445830 -0.506499 0.472224 -0.781246 -0.371485 -0.378250 -0.346282 0.308586 -0.219792 -0.219331 -0.232510 0.087260 0.296267 0.292144 0.239290 0.239446 0.231338 0.231404 0.233566 0.341667 0.350794 0.336640 0.304266
chargesum: 0.00000
title: Mulliken charges with hydrogens summed into heavy atoms:
elementType: S O N N N N N C C C C C C C C C C
charge: 0.189153 -0.239030 0.084888 -0.025911 -0.131099 -0.095036 0.134407 0.472224 -0.192835 -0.132195 -0.138803 -0.346282 0.308586 0.011546 0.012073 0.001056 0.087260
polarizability: 2.70844737e+02 2.02725993e+01 1.57738394e+02 -6.35333069e+00 1.86370508e+00 1.10361525e+02
1716.lowfreq: -6.2882 -4.3342 0.0006 0.0008 0.0020 4.6703 9.5156 19.0216 40.3820
frequency: 9.2262 18.7298 40.3679 50.6315 75.2901 114.2548 138.8989 157.0121 180.4151 198.5172 236.6218 270.7683 315.2608 325.3648 382.5151 401.4611 424.2353 445.6428 470.9579 529.0718 540.3737 555.5357 582.8496 616.3350 642.6118 664.8365 679.3506 702.1073 711.7617 715.3705 727.5209 775.9992 809.7617 839.7404 853.1096 885.9453 928.8369 962.5726 978.9996 990.0678 999.7952 1026.1419 1037.6506 1074.9960 1102.0474 1122.9204 1174.6387 1179.5437 1188.7570 1191.7917 1218.6802 1243.7057 1291.5456 1325.8289 1330.5047 1379.8200 1385.2014 1440.7891 1446.8699 1476.4783 1483.8404 1495.2137 1538.7839 1593.5026 1613.4448 1655.5256 1675.9934 3050.1043 3124.7451 3125.5755 3128.6485 3139.0919 3151.4043 3167.6374 3358.7378 3483.2995 3525.5337 3550.8563
redmass: 6.5740 4.0375 5.2650 5.4669 9.1142 6.7609 2.8913 6.1055 1.8084 5.4482 2.8744 4.6333 5.7253 2.5804 14.7012 2.8008 6.0614 9.9546 4.0444 6.3017 2.5126 2.8403 2.8401 6.3331 4.9525 2.0466 7.2497 1.6735 2.4228 4.8527 10.5237 2.1277 3.9093 1.7652 1.2498 1.5185 1.4433 6.5216 1.3910 6.2473 1.3217 2.2003 8.9692 1.4865 5.3335 1.0905 1.0530 4.1669 1.1179 5.6303 2.0252 1.5149 1.2944 1.2789 2.1926 1.6799 8.7857 2.1563 1.1293 3.5581 2.3496 2.0900 9.0846 6.0784 6.1094 6.9904 1.0707 1.0580 1.0859 1.0926 1.1041 1.0919 1.0963 1.1017 1.0439 1.0973 1.0795 1.0796
irintensity: 0.3121 0.8749 0.6896 0.4451 5.6600 3.3086 21.0782 2.1689 35.3927 1.0003 34.0017 12.6025 1.0983 1.2461 1.4634 0.0035 2.9737 1.6589 1.5289 10.7176 117.4306 87.7341 69.3113 0.1311 37.2039 47.9369 18.1976 61.9900 70.6447 17.9309 29.9294 25.7795 8.5715 331.3567 0.0572 0.6215 2.8224 40.1070 0.0137 1.0444 0.0934 5.8594 152.2943 8.5343 72.3285 1.4320 0.0196 25.5061 0.9872 18.8937 1.5308 36.3564 34.8204 0.2647 2.9952 26.1673 0.3555 9.4272 9.9509 62.2172 9.8045 26.6037 316.1200 1.0261 0.9497 644.5350 65.9662 5.9381 6.2879 0.2251 3.8060 12.0430 35.1545 23.0283 5.6467 8.4269 70.2551 60.2548
temp: 298.150 k
press: 1.00000 atm
elementType: 16 8 7 7 7 7 7 6 6 6 6 6 6 6 6 6 6 1 1 1 1 1 1 1 1 1 1 1
symmnumber: 1
zpe: 546983.9 jmol-1
zpe.correction: 0.208335 hartree
zpe.thermalcorrener: 0.224422 hartree
zpe.thermalcorrenthalpy: 0.225366 hartree
zpe.thermalcorrgfe: 0.160865 hartree
zpe.sumelectzpe: -1133.432024 hartree
zpe.sumelectthermal: -1133.415937 hartree
zpe.sumelectthermalent: -1133.414993 hartree
zpe.sumelectthermalfe: -1133.479495 hartree
dipole: 6.1177 1.3088 -0.7319
dipole: 6.2988
quadrupole: -125.7045 -102.8185 -101.3260
quadrupole: -10.1754 4.6394 -1.8105
quadrupole: -15.7548 7.1311 8.6237 -10.1754 4.6394 -1.8105
hfenergy: -1133.6403594 hartree
pointgroup: C01 [X(C10H11N5O1S1)]
dipole: 2.3959286 -0.4988941 0.3896308 debye
polarizability: 270.3079159|-19.4550056|157.2162653|13.4646252|2.2515933|111.4204754 unknown
InChI: InChI=1S/C10H11N5OS/c11-13-8-9(14-15-10(16)12-8)17-6-7-4-2-1-3-5-7/h1-5,13,15H,6,11H2
charge 0 multiplicity 1
28 atoms
S  0.31664 -0.73073 0.338068
O  -5.055369 1.583228 -0.454458
N  -1.473015 1.323602 0.015473
N  -2.352279 -2.235717 -0.031853
N  -3.748762 -0.381338 -0.246001
N  -2.753558 1.792179 -0.174778
N  -3.446877 -3.098153 -0.32583
C  2.872807 0.402196 0.074544
C  1.425348 0.81933 0.041582
C  3.526296 -0.031715 -1.108574
C  3.60621 0.443301 1.288844
C  -1.334239 0.002686 0.076433
C  -2.507944 -0.87038 -0.059749
C  4.885995 -0.411264 -1.079457
C  4.966092 0.062998 1.320013
C  5.609492 -0.36517 0.135426
C  -3.95008 1.003032 -0.299089
H  1.159434 1.532298 0.835764
H  1.108757 1.226126 -0.931218
H  2.967333 -0.069209 -2.051367
H  3.109308 0.775118 2.208465
H  5.38088 -0.739501 -2.000079
H  5.522448 0.102578 2.262883
H  6.664943 -0.658278 0.157956
H  -1.422648 -2.648089 -0.14388
H  -2.844317 2.808887 -0.225323
H  -4.198152 -2.515731 -0.734542
H  -3.774146 -3.562485 0.534445
