program: Gaussian 09
title: 000281284
version: EM64L-G09RevD.01
frameworkgroup: C1[X(C12H16O2)]
method: RPBEPBE
basis: SDD
operation: Freq
keyword: #pfreq=noraman
keyword: PBEPBE/SDD
title: #p freq=noraman PBEPBE/SDD
converged: NO YES NO NO
title: Mulliken charges:
elementType: O O C C C C C C C C C C C C H H H H H H H H H H H H H H H H
charge: -0.442882 -0.254294 -0.222932 -0.370836 0.548977 -0.353322 -0.719370 -0.445696 -0.390513 -0.691362 -0.353349 -0.347753 0.249450 0.107673 0.204772 0.191751 0.193174 0.189660 0.217835 0.215899 0.229232 0.212019 0.239233 0.234490 0.218509 0.207134 0.209978 0.268936 0.270924 0.382662
chargesum: 0.00000
title: Mulliken charges with hydrogens summed into heavy atoms:
elementType: O O C C C C C C C C C C C C
charge: -0.060220 -0.254294 -0.018160 0.014089 0.548977 0.054173 -0.062220 -0.206463 -0.156023 -0.055741 -0.084413 -0.076829 0.249450 0.107673
polarizability: 1.90137957e+02 -1.76859718e+01 9.83283297e+01 1.49499202e+00 4.53752468e-02 1.26574540e+02
1716.lowfreq: -1.9521 -0.0007 0.0006 0.0007 6.0912 10.1768 28.5939 41.1609 74.7243
frequency: 28.4864 41.1464 74.7109 75.9394 101.4112 139.6338 159.7104 194.6084 215.1189 222.0272 237.9211 284.1387 307.1652 378.2534 407.0294 413.4638 475.9674 495.8919 538.5233 573.3044 596.1513 632.1768 671.1002 694.5759 741.4517 769.9169 781.7119 858.3998 859.2295 871.2434 876.7885 929.2154 985.1720 991.1353 994.9686 1000.8904 1019.2493 1028.6062 1063.6614 1073.1620 1111.8025 1119.7455 1148.1047 1151.8970 1196.0600 1211.1256 1223.4067 1267.6700 1286.4080 1301.0930 1311.4448 1320.1778 1333.1412 1349.7043 1388.3129 1390.0806 1394.6233 1414.9688 1462.0490 1473.2911 1474.2987 1476.1121 1477.0593 1486.3949 1500.7835 1575.1086 1619.1761 1643.5107 2959.4618 2969.2911 2971.2408 2974.5477 2975.7686 3006.5335 3032.1355 3067.3444 3070.8384 3071.9562 3079.3250 3126.7066 3128.7877 3158.9540 3172.3736 3530.2990
redmass: 4.6745 4.2047 1.6286 5.6631 3.7376 4.1648 2.3817 2.9998 1.3078 1.2314 2.2410 3.8558 3.9631 3.6897 2.8493 3.6153 5.3299 3.4340 2.4694 3.5055 1.2703 6.9649 3.0950 3.4322 1.2147 3.7344 4.2286 1.3362 1.3705 1.6593 1.5232 2.0209 1.4110 1.4646 1.4132 4.3426 2.4637 2.0437 2.3232 1.9020 1.8443 1.7756 1.9408 1.6543 1.1772 2.1583 1.3953 1.2647 1.1763 1.3427 1.3375 2.8483 1.6411 1.5387 1.2956 1.2694 2.8799 2.8965 1.0747 1.0544 1.0530 1.0492 1.0747 1.0820 2.4932 7.0619 6.3086 8.5547 1.0597 1.0658 1.0375 1.0755 1.0370 1.0975 1.1024 1.1008 1.0994 1.0992 1.1001 1.0889 1.0892 1.0954 1.0951 1.0641
irintensity: 0.3953 0.0730 0.0080 0.8100 0.0959 0.8003 0.0275 0.0873 0.1738 0.0381 0.2795 0.8062 0.8583 7.8386 0.6875 5.0272 3.8019 14.8360 53.5864 29.5145 62.6759 0.3460 5.9667 83.7558 11.3307 6.5053 0.4456 9.3858 11.8733 14.9720 12.3676 4.0431 3.8439 26.3462 5.8856 174.8767 56.6525 61.7826 5.0592 10.6553 4.9642 8.3142 2.1064 120.2091 2.7356 0.2378 0.5364 0.6003 0.7045 1.4601 0.4512 119.2455 2.2451 3.6954 7.2023 12.7427 3.6177 17.0075 0.9689 2.6523 16.4697 15.2999 1.5609 12.6562 14.2875 15.1681 76.4791 322.1767 9.3063 25.1067 35.7137 36.1835 51.3127 8.2035 34.1610 52.7411 81.3049 44.5610 34.6578 13.0188 13.5756 5.9012 1.9485 44.7684
temp: 298.150 k
press: 1.00000 atm
elementType: 8 8 6 6 6 6 6 6 6 6 6 6 6 6 1 1 1 1 1 1 1 1 1 1 1 1 1 1 1 1
symmnumber: 1
zpe: 659180.5 jmol-1
zpe.correction: 0.251069 hartree
zpe.thermalcorrener: 0.265653 hartree
zpe.thermalcorrenthalpy: 0.266598 hartree
zpe.thermalcorrgfe: 0.208376 hartree
zpe.sumelectzpe: -616.287250 hartree
zpe.sumelectthermal: -616.272665 hartree
zpe.sumelectthermalent: -616.271721 hartree
zpe.sumelectthermalfe: -616.329943 hartree
dipole: -2.5402 0.5205 -1.1761
dipole: 2.8472
quadrupole: -84.2495 -86.1235 -82.0219
quadrupole: -2.1522 -8.9815 1.7230
quadrupole: -0.1179 -1.9919 2.1098 -2.1522 -8.9815 1.7230
hfenergy: -616.5383186 hartree
pointgroup: C01 [X(C12H16O2)]
dipole: -1.0051871 -0.18198 0.4596802 debye
polarizability: 190.4337665|16.9185632|98.0988577|-1.4600798|1.1421034|126.5082026 unknown
InChI: InChI=1S/C12H16O2/c1-3-4-9(2)10-5-7-11(8-6-10)12(13)14/h5-9,13H,3-4H2,1-2H3
charge 0 multiplicity 1
30 atoms
O  3.918276 0.569342 1.355497
O  4.202174 0.514304 -0.948219
C  -2.236191 -1.051285 -0.268923
C  -3.170054 0.051237 0.312869
C  -0.7587 -0.667135 -0.173836
C  -3.106552 1.397228 -0.443099
C  -2.5022 -2.417163 0.419848
C  0.035351 -0.532467 -1.34308
C  -0.139678 -0.446438 1.087347
C  -4.069679 2.451725 0.143105
C  1.399558 -0.191942 -1.26283
C  1.222101 -0.104933 1.180858
C  2.003071 0.024434 0.002309
C  3.443252 0.38118 0.043378
H  -2.484534 -1.160866 -1.344808
H  -2.921655 0.216747 1.381842
H  -4.211846 -0.330307 0.291936
H  -3.35056 1.225497 -1.511888
H  -2.069748 1.786093 -0.418855
H  -3.557866 -2.717706 0.285574
H  -1.859208 -3.211306 -0.000251
H  -2.30321 -2.360951 1.506391
H  -0.425443 -0.697389 -2.324442
H  -0.730355 -0.543624 2.005891
H  -4.011286 3.404714 -0.4140
H  -5.118375 2.100181 0.103589
H  -3.827338 2.664412 1.201682
H  2.013857 -0.087618 -2.163406
H  1.693693 0.063486 2.153301
H  4.883543 0.804755 1.308021
