program: Gaussian 09
title: 000281345
version: EM64L-G09RevD.01
frameworkgroup: C1[X(C15H18N4O5S2)]
method: RPBEPBE
basis: SDD
operation: Freq
keyword: #p
keyword: freq=noraman
keyword: PBEPBE/SDD
title: #p freq=noraman PBEPBE/SDD
converged: YES YES NO NO
title: Mulliken charges:
elementType: S S O O O O O N N N N C C C C C C C C C C C C C C C H H H H H H H H H H H H H H H H H H
charge: 0.946399 0.136900 -0.177511 -0.169036 -0.183032 -0.533380 -0.515216 -0.199013 -0.524727 -0.092699 -0.096507 -0.052446 -0.506336 -0.307210 -0.407187 0.218106 -0.396471 0.234146 -0.662323 -0.046092 -0.773245 0.191541 -0.236025 -0.183855 -0.265019 -0.334231 0.248877 0.267243 0.251953 0.241347 0.337019 0.251392 0.246168 0.299152 0.262139 0.268192 0.347160 0.279466 0.238446 0.254454 0.291958 0.291241 0.285700 0.272561
chargesum: 0.00000
title: Mulliken charges with hydrogens summed into heavy atoms:
elementType: S S O O O O O N N N N C C C C C C C C C C C C C C C
charge: 0.946399 0.136900 -0.177511 -0.169036 -0.183032 -0.533380 -0.515216 0.100139 -0.177567 -0.092699 -0.096507 -0.052446 0.009784 0.186090 -0.070167 0.218106 0.101088 0.234146 -0.131992 -0.046092 -0.000880 0.191541 0.055932 0.107386 0.020681 -0.061670
polarizability: 4.23993826e+02 5.61923605e+00 2.29681975e+02 -5.43667027e+00 1.52940478e+01 2.01221339e+02
1716.lowfreq: -10.4822 -7.1919 -4.1119 0.0015 0.0025 0.0029 4.5441 10.1113 25.1342
frequency: -4.5809 9.0287 25.0819 28.7719 34.0250 35.3892 58.8106 71.2494 81.0909 94.6043 96.3535 127.7526 134.7586 148.6346 155.5433 164.3828 181.0948 192.6948 203.9445 232.3754 246.7490 264.9355 272.9278 292.0052 304.5476 316.1675 326.3831 364.5384 369.9703 403.8932 417.6840 434.4698 440.3108 461.8903 492.0841 509.5674 517.9607 535.6770 541.9105 565.8973 587.0366 614.9109 618.5137 640.4387 656.3286 657.7828 668.6215 730.8524 739.5160 749.6238 786.2833 802.3218 804.4848 842.8886 847.5668 868.8669 870.5410 894.7373 909.7300 922.3908 939.9493 948.2298 963.5647 978.4712 982.5534 992.0020 999.8211 1006.5288 1018.6115 1030.3206 1043.4883 1045.8159 1062.4304 1100.0696 1108.0238 1113.0268 1125.0729 1154.5255 1156.6432 1167.0760 1174.9227 1192.7783 1199.7328 1220.5532 1229.5957 1248.9677 1286.3474 1289.1502 1297.7707 1313.4291 1344.9239 1346.0661 1365.4088 1378.3161 1393.2691 1406.5099 1436.3982 1442.5852 1445.8287 1455.4681 1457.2931 1462.0380 1464.8612 1476.2249 1578.4675 1593.8064 1618.0015 1710.6489 2993.1593 3020.8075 3025.2777 3033.2050 3046.5193 3049.0820 3082.1399 3089.5512 3092.3769 3115.3057 3124.7827 3129.5302 3154.5299 3162.6670 3175.5738 3180.0607 3410.5828 3430.1047
redmass: 5.9208 6.9385 5.7292 6.0452 5.1409 4.7452 5.8844 5.8983 4.0897 6.5504 7.2235 4.4246 5.0359 4.9166 4.2869 1.4140 8.9912 4.7250 5.4388 6.2150 3.7938 2.8502 4.5123 3.4686 5.8159 5.1455 5.8410 6.0568 5.0886 3.4000 6.3581 5.4537 6.5305 7.6158 4.2229 3.6029 3.7699 3.6793 3.4569 4.6779 5.9381 7.0359 4.0643 3.0985 4.8879 4.3140 4.6856 3.6444 4.3778 2.1018 2.0623 3.1450 7.2019 4.2564 1.2836 1.5273 1.6160 3.2352 3.0185 2.9730 2.2574 5.2559 2.2057 1.4559 2.1394 4.6037 1.3556 2.8820 2.8473 1.3216 4.1779 3.3479 3.3859 3.4571 1.4825 2.0347 2.0833 1.6315 1.3800 1.5776 1.4976 1.4703 2.1777 1.8803 1.3994 1.1607 1.2717 1.3312 1.3796 1.2506 1.1956 1.3041 1.2428 5.5549 10.5717 4.0486 1.1896 1.0706 1.0700 1.1069 2.1995 1.0891 1.0857 1.0889 6.4783 7.4677 8.8998 12.8890 1.0358 1.0602 1.0597 1.0581 1.0867 1.0611 1.0961 1.1049 1.1041 1.1095 1.1016 1.1092 1.0892 1.0889 1.0958 1.0978 1.0762 1.0746
irintensity: 2.5555 2.4488 1.8734 1.2451 3.4232 0.6413 1.2138 0.2274 1.5698 3.7252 1.8198 1.1637 4.3501 0.4677 1.5080 1.9478 2.9227 5.5395 12.5828 7.1791 5.2287 0.8469 32.7640 1.2000 10.6229 8.0319 8.9381 2.6862 9.3265 8.6596 25.3304 20.7207 102.8634 3.3292 29.0965 3.7398 23.7462 3.8643 28.4882 3.2873 70.0155 0.7513 12.8193 15.2336 13.8606 3.3514 2.0090 2.8302 20.3634 19.5288 311.2613 17.9510 139.6961 5.5308 3.8786 42.3821 11.1276 11.8824 4.2121 57.4544 19.5611 40.1315 33.3586 1.1781 32.6696 9.5388 0.2562 16.5793 12.2483 4.6729 329.0997 82.0793 3.7754 6.4210 11.0422 11.3882 40.9319 26.6619 13.0763 50.7769 19.5769 16.3283 21.4748 58.2551 5.0024 20.9043 1.9974 6.0991 4.1324 1.2699 1.2162 3.1511 55.2785 11.4644 10.7882 21.1022 43.4700 22.8608 41.9610 10.4469 11.7589 6.0071 13.5100 11.7409 8.0652 1.8057 175.8732 185.2904 1.4673 29.7541 9.0907 35.1718 7.7944 37.6569 4.5757 11.3262 11.6693 18.0014 12.0474 13.1878 3.7191 1.4235 0.1454 1.1635 50.5687 9.3568
temp: 298.150 k
press: 1.00000 atm
elementType: 16 16 8 8 8 8 8 7 7 7 7 6 6 6 6 6 6 6 6 6 6 6 6 6 6 6 1 1 1 1 1 1 1 1 1 1 1 1 1 1 1 1 1 1
symmnumber: 1
zpe: 846055.5 jmol-1
zpe.correction: 0.322246 hartree
zpe.thermalcorrener: 0.348040 hartree
zpe.thermalcorrenthalpy: 0.348985 hartree
zpe.thermalcorrgfe: 0.262691 hartree
zpe.sumelectzpe: -1971.463936 hartree
zpe.sumelectthermal: -1971.438141 hartree
zpe.sumelectthermalent: -1971.437197 hartree
zpe.sumelectthermalfe: -1971.523490 hartree
dipole: 3.2826 -0.0995 -0.9264
dipole: 3.4123
quadrupole: -166.6757 -180.0091 -164.2321
quadrupole: -51.9803 -16.1224 2.9417
quadrupole: 3.6299 -9.7034 6.0735 -51.9803 -16.1224 2.9417
hfenergy: -1971.7861814 hartree
pointgroup: C01 [X(C15H18N4O5S2)]
dipole: -1.2955329 0.1178057 0.3316472 debye
polarizability: 424.2424551|-2.2564629|208.9260536|-0.9125602|-19.9686315|221.7286315 unknown
InChI: InChI=1S/C15H18N4O5S2/c1-10(20)15(6-8-24-13(15)21)19-17-11-2-4-12(5-3-11)26(22,23)18-14-16-7-9-25-14/h2-5,14,16,18H,6-9H2,1H3
charge 0 multiplicity 1
44 atoms
S  3.763356 -1.067556 1.530871
S  6.786091 2.069335 0.342739
O  -5.401483 2.624717 0.591424
O  -3.44833 2.530725 -0.659083
O  -5.7218 0.003298 -1.329133
O  3.871245 -1.399549 3.120445
O  4.370639 -2.052305 0.382865
N  4.322778 1.551735 -0.867654
N  4.528789 0.662136 1.334347
N  -2.912083 0.17027 1.076759
N  -2.074743 -0.078493 0.112373
C  -4.27045 0.476313 0.566003
C  -5.289683 0.506905 1.73766
C  -6.247015 1.654304 1.352854
C  5.201163 0.864469 0.052057
C  -4.285831 1.976485 0.057271
C  5.12032 2.312512 -1.84812
C  -4.828998 -0.445335 -0.567477
C  6.173611 3.170627 -1.067092
C  1.951751 -0.743727 1.117357
C  -4.351913 -1.882526 -0.628304
C  -0.716319 -0.30041 0.53918
C  1.06836 -0.536056 2.193237
C  1.56801 -0.745842 -0.232744
C  -0.287858 -0.310743 1.896204
C  0.205002 -0.519859 -0.516881
H  -5.824212 -0.447145 1.880953
H  -4.72921 0.739178 2.659886
H  -7.055743 1.326696 0.67941
H  -6.6558 2.204644 2.212715
H  5.627696 -0.053053 -0.387763
H  4.461326 2.946217 -2.465253
H  5.647945 1.605067 -2.512088
H  3.662625 2.141588 -0.338169
H  5.72413 4.085753 -0.648362
H  7.036837 3.429706 -1.700496
H  5.137826 0.775392 2.164418
H  -3.382973 -1.915239 -1.158802
H  -4.181234 -2.304265 0.378209
H  -5.087048 -2.485859 -1.183295
H  1.440856 -0.56889 3.222253
H  2.302641 -0.916819 -1.02477
H  -1.022599 -0.140278 2.688156
H  -0.164967 -0.497524 -1.54626
