program: Gaussian 09
title: 000281268
version: EM64L-G09RevD.01
frameworkgroup: C1[X(C12H16O2)]
method: RPBEPBE
basis: SDD
operation: Freq
keyword: #pfreq=noraman
keyword: PBEPBE/SDD
title: #p freq=noraman PBEPBE/SDD
converged: YES YES NO NO
title: Mulliken charges:
elementType: O O C C C C C C C C C C C C H H H H H H H H H H H H H H H H
charge: -0.286416 -0.206495 -0.389523 -0.241748 -0.486505 -0.345705 0.380484 0.223605 -0.377838 -0.410847 -0.767687 -0.228263 -0.217408 -0.242339 0.241715 0.228404 0.180636 0.180946 0.229817 0.225669 0.200988 0.201360 0.223791 0.279723 0.241551 0.230218 0.258012 0.223293 0.224631 0.225928
chargesum: 0.00000
title: Mulliken charges with hydrogens summed into heavy atoms:
elementType: O O C C C C C C C C C C C C
charge: -0.286416 -0.206495 0.080597 0.119835 -0.031019 0.056644 0.380484 0.223605 -0.154047 -0.131124 -0.037906 -0.004970 0.007223 -0.016411
polarizability: 1.82454601e+02 -5.62538348e+00 1.36879402e+02 7.08582194e-01 -7.93045656e-02 7.72033434e+01
1716.lowfreq: -11.3020 -7.1136 -0.0006 -0.0005 0.0000 2.3639 11.6721 24.3067 40.5693
frequency: 11.4767 24.1418 40.5650 47.3392 65.9432 94.7472 107.8059 124.9112 129.3880 196.1126 204.4112 251.7554 372.6982 377.7405 401.8381 457.8299 463.4023 492.0779 578.8200 595.3487 616.2958 702.3058 735.7249 737.9269 803.0677 815.1204 831.8472 856.7040 909.1265 936.9413 948.4935 958.4592 978.7419 989.5141 995.4682 1019.7073 1026.2391 1059.2268 1072.2904 1080.5240 1094.1003 1107.0149 1165.7587 1170.5070 1170.9806 1184.2490 1203.8333 1214.0936 1255.9496 1264.8115 1276.8304 1306.4968 1336.7809 1355.6474 1367.8413 1384.8327 1406.1377 1431.7111 1439.2663 1443.6807 1456.9334 1463.3480 1473.2614 1485.2601 1489.9944 1594.9748 1618.5178 1639.3303 2893.6000 2904.0791 2935.7016 2945.1270 2950.8113 2980.7507 2998.5743 3021.3379 3067.6182 3085.6827 3107.6016 3119.7967 3125.0167 3138.8775 3157.7090 3177.5575
redmass: 3.8217 3.7663 4.7201 2.7550 2.4452 1.1062 2.6570 2.8488 3.1493 6.3056 2.9724 4.1036 4.3032 3.6876 2.8386 2.1327 2.7565 3.8342 4.4416 4.8426 6.3650 2.3323 1.1809 1.3430 3.9723 2.4658 1.5194 1.2510 1.3095 4.1740 2.1516 1.3450 1.3714 6.2863 1.3498 1.6978 2.2415 5.2855 2.8111 1.8754 2.8210 1.8985 1.4032 1.7084 1.0711 1.1157 1.0911 2.4707 1.2282 1.3729 1.1368 1.4411 1.3530 1.7380 1.2422 4.3824 1.6841 1.0972 2.1194 1.0655 1.0582 1.0931 1.0853 2.2357 1.1018 6.1889 6.0317 7.8889 1.0546 1.0543 1.1037 1.1059 1.0613 1.0382 1.0958 1.0607 1.0949 1.1031 1.0876 1.1005 1.0866 1.0931 1.0988 1.0956
irintensity: 5.9294 0.6154 0.9458 1.4837 1.4517 0.6546 3.6664 2.1180 3.1095 0.8137 1.8584 8.3037 2.1376 2.4839 0.0155 0.9817 8.9620 17.9585 0.2866 3.7345 0.1290 26.6173 17.1165 75.9465 2.2321 1.5505 0.6248 0.2041 1.5177 11.9145 11.3732 5.2356 0.0248 0.0998 0.0992 1.6779 27.3857 145.2777 1.3827 5.1762 52.3869 0.4413 17.9544 46.9121 1.4132 1.4538 3.6009 1.6807 4.7551 38.7322 5.1492 46.3821 59.2248 11.8116 62.1266 9.5277 2.6261 21.9478 10.4649 19.9108 17.8875 15.9716 4.4772 17.1676 6.5054 1.7292 8.5697 103.7127 18.5889 109.6798 63.2556 50.1088 25.4182 5.3752 13.7269 12.4475 14.6905 30.1215 11.9015 13.7482 1.3478 35.4001 32.6325 5.8201
temp: 298.150 k
press: 1.00000 atm
elementType: 8 8 6 6 6 6 6 6 6 6 6 6 6 6 1 1 1 1 1 1 1 1 1 1 1 1 1 1 1 1
symmnumber: 1
zpe: 655099.4 jmol-1
zpe.correction: 0.249514 hartree
zpe.thermalcorrener: 0.264644 hartree
zpe.thermalcorrenthalpy: 0.265588 hartree
zpe.thermalcorrgfe: 0.202998 hartree
zpe.sumelectzpe: -616.240888 hartree
zpe.sumelectthermal: -616.225759 hartree
zpe.sumelectthermalent: -616.224814 hartree
zpe.sumelectthermalfe: -616.287404 hartree
dipole: 1.3012 -4.4908 0.3631
dipole: 4.6896
quadrupole: -71.6457 -82.3124 -86.3211
quadrupole: -12.7581 2.4514 1.1932
quadrupole: 8.4473 -2.2193 -6.2280 -12.7581 2.4514 1.1932
hfenergy: -616.4904025 hartree
pointgroup: C01[X(C12H16O2)]
dipole: 0.5772431 -1.4988871 0.9079216 debye
polarizability: 182.3818707|-6.6580544|123.9178215|-3.7645567|-24.2043827|90.237654 unknown
InChI: InChI=1S/C12H16O2/c1-11(13)6-5-9-14-10-12-7-3-2-4-8-12/h2-4,7-8H,5-6,9-10H2,1H3
charge 0 multiplicity 1
30 atoms
O  -0.028751 -0.338304 0.063239
O  4.60864 1.293355 -1.394696
C  2.343656 -0.021484 -0.263523
C  1.271462 -0.989622 0.242934
C  3.76025 -0.603464 -0.104082
C  -1.141087 -1.172112 0.51363
C  -2.454075 -0.442005 0.281551
C  4.865254 0.289303 -0.680355
C  -3.669185 -1.047537 0.691543
C  -2.48987 0.828465 -0.339976
C  6.299593 -0.098559 -0.331818
C  -4.903053 -0.39361 0.482365
C  -3.72613 1.483421 -0.548576
C  -4.935525 0.876956 -0.13995
H  2.154679 0.217013 -1.324741
H  2.262356 0.932126 0.288747
H  1.428917 -1.231267 1.320057
H  1.299718 -1.946325 -0.329165
H  3.838341 -1.587945 -0.616254
H  3.997746 -0.810646 0.96054
H  -1.021746 -1.411871 1.595747
H  -1.137248 -2.139108 -0.041482
H  -3.653079 -2.032883 1.176066
H  -1.54806 1.288297 -0.650828
H  6.542741 0.281864 0.680049
H  6.433882 -1.194969 -0.309408
H  7.002945 0.355653 -1.047349
H  -5.835274 -0.871996 0.803853
H  -3.743052 2.467805 -1.030412
H  -5.892147 1.386248 -0.302705
