program: Gaussian 09
title: 000281265
version: EM64L-G09RevD.01
frameworkgroup: C1[X(C16H14O)]
method: RPBEPBE
basis: SDD
operation: Freq
keyword: #pfreq=noraman
keyword: PBEPBE/SDD
title: #p freq=noraman PBEPBE/SDD
converged: YES YES NO NO
title: Mulliken charges:
elementType: O C C C C C C C C C C C C C C C C H H H H H H H H H H H H H H
charge: -0.433260 0.207365 0.201486 0.197572 0.464052 0.463748 -0.619593 -0.798319 -0.379024 -0.383102 -0.341479 -0.457034 -0.455912 -0.265462 -0.266430 -0.246506 -0.245548 0.243385 0.216410 0.244793 0.224680 0.241344 0.209591 0.239820 0.244847 0.244419 0.226173 0.228288 0.230003 0.229954 0.333739
chargesum: 0.00000
title: Mulliken charges with hydrogens summed into heavy atoms:
elementType: O C C C C C C C C C C C C C C C C
charge: -0.099522 0.207365 0.201486 0.197572 0.464052 0.463748 -0.159798 -0.553526 -0.154344 -0.141758 0.107933 -0.212187 -0.211493 -0.039289 -0.038142 -0.016502 -0.015595
polarizability: 2.95440265e+02 -3.00181510e+00 1.98168007e+02 4.42316056e-01 -1.53116706e+01 8.08271863e+01
1716.lowfreq: -7.5462 0.0002 0.0005 0.0006 9.2053 13.6730 49.3245 66.8538 93.7526
frequency: 49.1719 66.8368 93.7467 105.3784 122.1557 195.1086 237.2751 239.7996 299.8043 321.1713 332.3690 370.6078 389.1439 411.9077 415.5973 475.1014 503.6238 547.9714 549.8040 587.7564 603.7981 635.4041 644.9146 694.9407 744.2673 755.5028 765.8701 783.6811 810.4128 839.0162 854.4799 859.6750 867.0923 903.6575 925.6499 958.1192 959.6603 968.1039 987.6672 989.9078 1015.0838 1018.6389 1024.9321 1046.7067 1055.0960 1105.7425 1134.7386 1164.6022 1172.3340 1185.3031 1202.9876 1248.4903 1257.4854 1274.1686 1285.5643 1294.5739 1333.4813 1349.3893 1370.6005 1378.2844 1388.2839 1415.3376 1439.0768 1445.1447 1449.8064 1475.8636 1486.0427 1517.1206 1537.4300 1566.9506 1582.7772 1629.3851 1632.4378 2969.4378 3007.6402 3062.3733 3089.9355 3118.5043 3121.3290 3122.2919 3131.4481 3133.5513 3149.6193 3151.1748 3164.0826 3165.5401 3560.5937
redmass: 5.7792 4.3545 5.0123 2.4326 2.6816 4.3715 4.6550 4.0908 1.3886 3.5052 3.9974 2.4608 6.1625 3.3669 4.3748 2.7018 3.4618 3.1018 4.5579 3.8308 6.4653 5.3081 5.4023 5.1251 1.2688 3.2669 1.3489 1.4433 2.0554 2.1801 1.6711 4.2175 1.6136 4.2044 1.9448 4.4171 1.3709 1.4560 1.3421 1.3676 3.5455 2.7334 2.4414 3.8931 1.7608 2.2827 1.2110 1.3080 1.1169 1.1357 1.2721 1.5684 1.3812 1.8092 1.2573 1.8339 1.3509 4.6553 2.2119 1.1970 1.9303 4.2913 9.0517 2.7081 2.3135 1.2413 1.7251 1.2482 6.2095 7.5958 5.3965 6.4754 6.0715 1.0684 1.0639 1.0939 1.0990 1.0906 1.0861 1.0867 1.0879 1.0883 1.0942 1.0944 1.1001 1.0998 1.0662
irintensity: 1.5149 0.0826 0.9908 4.2464 3.5060 1.1975 0.0036 0.4417 87.7666 16.6172 42.0402 18.1063 2.9369 14.7137 1.0746 0.0459 0.0001 9.1036 0.6802 1.7682 5.0664 4.4495 3.4506 4.3924 117.2646 0.6079 0.3972 4.9768 15.3225 2.0225 21.3959 7.2105 0.4762 1.4451 25.6959 117.7235 0.8471 13.1139 0.5742 1.7075 32.8975 24.7747 0.1910 5.5320 19.0277 0.3785 21.6645 10.6614 0.6033 0.4651 4.4476 3.1687 15.8787 6.8310 0.5505 0.7436 16.4631 14.1513 0.0944 22.1695 1.1322 6.7044 3.9599 2.7200 8.5885 1.2412 3.5458 17.3425 5.7799 0.8947 2.1996 0.0206 5.1610 40.1646 38.1210 8.7157 21.5981 2.7959 0.0914 8.2787 3.8033 8.3315 28.0625 39.4448 61.6870 15.8948 9.9281
temp: 298.150 k
press: 1.00000 atm
elementType: 8 6 6 6 6 6 6 6 6 6 6 6 6 6 6 6 6 1 1 1 1 1 1 1 1 1 1 1 1 1 1
symmnumber: 1
zpe: 659725.8 jmol-1
zpe.correction: 0.251276 hartree
zpe.thermalcorrener: 0.264939 hartree
zpe.thermalcorrenthalpy: 0.265883 hartree
zpe.thermalcorrgfe: 0.210770 hartree
zpe.sumelectzpe: -692.152357 hartree
zpe.sumelectthermal: -692.138695 hartree
zpe.sumelectthermalent: -692.137750 hartree
zpe.sumelectthermalfe: -692.192863 hartree
dipole: -1.3529 -1.0465 -0.5020
dipole: 1.7826
quadrupole: -86.1017 -95.6672 -106.1284
quadrupole: -7.6730 -0.1280 -7.3050
quadrupole: 9.8641 0.2986 -10.1627 -7.6730 -0.1280 -7.3050
hfenergy: -692.4036332 hartree
pointgroup: C01 [X(C16H14O1)]
dipole: -0.5169432 -0.4314697 -0.196142 debye
polarizability: 295.5251617|0.4857468|197.8914433|1.4734155|-15.981833|81.0188534 unknown
InChI: InChI=1S/C16H14O/c17-10-9-16-14-7-3-1-5-12(14)11-13-6-2-4-8-15(13)16/h1-8,11,17H,9-10H2
charge 0 multiplicity 1
31 atoms
O  0.093882 4.512332 0.41117
C  -0.020216 0.735179 -0.34671
C  -1.25081 0.016814 -0.196743
C  1.227613 0.046988 -0.194679
C  -1.22631 -1.418871 0.078476
C  1.23818 -1.388387 0.081569
C  -0.031974 2.232048 -0.624337
C  0.014046 -2.08426 0.203641
C  -2.546372 0.649453 -0.295211
C  2.506212 0.713742 -0.290499
C  -0.019438 3.071678 0.680858
C  -2.468081 -2.136706 0.222937
C  2.497029 -2.075229 0.22787
C  -3.7261 -0.073815 -0.145558
C  3.702918 0.019556 -0.137623
C  -3.691194 -1.486581 0.11475
C  3.703247 -1.393775 0.121762
H  0.84139 2.533484 -1.227062
H  -0.919222 2.511922 -1.222429
H  0.026971 -3.162097 0.409204
H  -2.609698 1.724231 -0.490955
H  2.543241 1.790075 -0.483467
H  -0.919067 2.845772 1.291292
H  0.873416 2.833631 1.281541
H  -2.426056 -3.213759 0.424923
H  2.481871 -3.153056 0.429545
H  -4.693365 0.434803 -0.225547
H  4.656794 0.55307 -0.214539
H  -4.629078 -2.040922 0.227926
H  4.654733 -1.924173 0.236543
H  -0.712563 4.815753 -0.077445
