program: Gaussian 09
title: 000281299
version: EM64L-G09RevD.01
frameworkgroup: C1[X(C15H8F6O3)]
method: RPBEPBE
basis: SDD
operation: Freq
keyword: #p
keyword: freq=noraman
keyword: PBEPBE/SDD
title: #p freq=noraman PBEPBE/SDD
converged: YES YES NO NO
title: Mulliken charges:
elementType: F F F F F F O O O C C C C C C C C C C C C C C C H H H H H H H H
charge: -0.144840 -0.153834 -0.145537 -0.128456 -0.153759 -0.153907 -0.274517 -0.204603 -0.203675 0.304459 0.266748 0.306867 -0.084652 0.016216 -0.297704 -0.515974 -0.355703 0.166849 -0.361126 -0.213680 -0.227431 -0.216339 0.301136 0.267371 0.290466 0.267657 0.285105 0.287868 0.293417 0.291803 0.245011 0.244763
chargesum: 0.00000
title: Mulliken charges with hydrogens summed into heavy atoms:
elementType: F F F F F F O O O C C C C C C C C C C C C C C C
charge: -0.144840 -0.153834 -0.145537 -0.128456 -0.153759 -0.153907 -0.274517 -0.204603 -0.203675 0.304459 0.266748 0.306867 -0.084652 0.016216 0.260420 -0.230869 -0.067834 0.166849 -0.069323 0.079738 0.017580 0.028423 0.301136 0.267371
polarizability: 2.84536132e+02 -7.90980619e+00 1.87552071e+02 -1.26130119e+01 1.38816594e+01 8.99560962e+01
1716.lowfreq: -5.8329 -3.0673 -0.0010 -0.0008 -0.0006 6.1034 10.3963 14.4788 23.5621
frequency: 9.9286 13.9229 23.5167 39.5703 56.4996 64.7102 86.9493 119.9949 123.3008 130.7635 145.3346 161.6173 196.7501 203.0574 253.0154 263.6028 280.4279 301.0171 311.2164 322.4573 361.0309 382.3606 399.9969 421.1353 429.5560 444.4606 454.7326 462.4219 470.0502 481.7649 485.4497 513.1588 592.8847 615.8563 644.4105 660.9739 666.7560 672.1339 698.6932 716.3701 725.2896 791.9171 793.5708 821.8500 825.0747 860.7470 895.6735 909.7919 928.8391 970.2477 975.3168 991.1254 997.0186 1002.9797 1015.3906 1025.1754 1033.6579 1072.1742 1081.2553 1095.8767 1119.7702 1162.5473 1172.7695 1184.0152 1201.5854 1224.7890 1241.5664 1264.2384 1310.5733 1325.4732 1338.9047 1360.6595 1400.7498 1426.9899 1440.8271 1471.0527 1527.5177 1544.4010 1576.3539 1606.9968 1612.6681 1680.1901 3016.9835 3080.7933 3140.9878 3150.1282 3154.1702 3164.1312 3172.5165 3174.6704
redmass: 11.1427 9.2922 13.4073 9.6006 9.8052 11.7882 5.5543 9.1844 4.9361 11.8733 4.3716 8.9457 8.3033 5.7018 5.6408 7.4763 13.0854 7.3231 16.7926 5.1863 9.5141 4.4270 9.7209 12.7595 4.2699 7.4081 9.6345 9.4615 13.6462 13.6806 4.0608 9.6417 9.7020 9.1920 8.8689 7.4981 3.6377 6.0704 7.4720 4.1494 5.4058 1.6275 4.1139 2.9287 1.4647 8.3472 1.5009 8.1398 1.6158 6.5746 7.1732 7.3000 1.3971 2.1902 1.3656 7.1135 2.2060 3.2568 10.6545 4.6231 1.8472 3.7374 1.1415 1.3473 2.3021 1.8662 2.2269 1.7884 3.9233 1.8692 2.5533 1.9552 9.4474 1.0834 2.5032 2.7754 10.2506 9.6272 7.5093 6.7168 7.9814 8.6803 1.0578 1.1037 1.0865 1.0907 1.0901 1.0948 1.0924 1.1004
irintensity: 0.2681 0.2901 0.1300 0.7863 6.7777 3.1518 2.7131 0.6950 0.6837 3.2545 2.8780 4.4384 1.5271 1.8918 0.6786 0.5696 1.0788 0.4645 0.2152 0.4466 10.5628 3.3242 26.6263 1.2225 3.4617 2.1367 8.4057 10.9075 13.9901 1.0189 3.1301 1.4438 27.2009 3.8977 13.1041 0.9486 3.3267 5.9142 2.5340 16.0493 23.4939 59.4576 8.5346 6.3568 12.3983 53.8814 23.4762 130.2369 2.8954 56.1220 126.4194 49.7812 2.5804 142.5617 0.0914 332.4366 5.6022 41.0339 126.8000 64.4324 14.1356 453.3455 20.8932 74.1036 195.7101 8.9875 319.0881 57.1278 123.0447 44.0292 99.0165 76.3485 0.2789 81.7790 0.1108 0.5108 41.2984 369.2180 137.2198 1.7930 103.3877 82.9136 21.0985 5.8474 3.4045 3.4777 3.0799 1.2340 3.9020 21.7154
temp: 298.150 k
press: 1.00000 atm
elementType: 9 9 9 9 9 9 8 8 8 6 6 6 6 6 6 6 6 6 6 6 6 6 6 6 1 1 1 1 1 1 1 1
symmnumber: 1
zpe: 524824.7 jmol-1
zpe.correction: 0.199895 hartree
zpe.thermalcorrener: 0.221321 hartree
zpe.thermalcorrenthalpy: 0.222265 hartree
zpe.thermalcorrgfe: 0.145158 hartree
zpe.sumelectzpe: -1399.367473 hartree
zpe.sumelectthermal: -1399.346047 hartree
zpe.sumelectthermalent: -1399.345103 hartree
zpe.sumelectthermalfe: -1399.422210 hartree
dipole: -4.5571 -1.7596 -0.9346
dipole: 4.9736
quadrupole: -136.0832 -144.0949 -137.2109
quadrupole: 19.7043 -0.9324 -1.7106
quadrupole: 3.0465 -4.9653 1.9188 19.7043 -0.9324 -1.7106
hfenergy: -1399.5673678 hartree
pointgroup: C01 [X(C15H8F6O3)]
dipole: 1.7857508 -0.7236833 0.3409825 debye
polarizability: 284.9327335|8.8588976|189.1462588|-8.3901953|-5.4212709|87.9653076 unknown
InChI: InChI=1S/C15H8F6O3/c16-14(17,18)12(15(19,20)21)5-6-24-11-7-10(22)8-3-1-2-4-9(8)13(11)23/h1-5,7H,6H2
charge 0 multiplicity 1
32 atoms
F  -5.585753 1.146457 -1.189162
F  -4.633434 2.31139 0.507232
F  -5.829177 0.441332 0.953387
F  -5.094189 -1.629154 -0.828742
F  -3.172267 -1.272177 -1.978792
F  -3.095033 -2.169822 0.098105
O  -0.12082 1.078362 0.314922
O  1.15976 -1.524028 0.486553
O  4.153229 3.012736 -0.361545
C  3.344041 -0.572267 0.070598
C  4.12786 0.599158 -0.136234
C  1.242669 0.876254 0.156783
C  1.867582 -0.492425 0.250846
C  3.473782 1.94839 -0.182405
C  -1.119996 -0.019773 0.246248
C  2.014293 2.002257 -0.028762
C  3.971493 -1.842726 0.115396
C  -3.64571 0.185744 -0.091438
C  5.526999 0.489045 -0.296934
C  -2.445073 0.689579 0.293828
C  5.368226 -1.945468 -0.047642
C  6.146497 -0.779215 -0.254241
C  -4.905525 1.005652 0.042138
C  -3.769769 -1.196662 -0.689414
H  -0.998421 -0.701164 1.107425
H  -0.979494 -0.620382 -0.668862
H  1.543383 2.989003 -0.074089
H  3.349639 -2.728657 0.27816
H  -2.40942 1.707186 0.701561
H  6.104235 1.405826 -0.453254
H  5.851724 -2.927144 -0.013697
H  7.231168 -0.862009 -0.380068
