program: Gaussian 09
title: 000281245
version: EM64L-G09RevD.01
frameworkgroup: C1[X(C5H15N2O3P)]
method: RPBEPBE
basis: SDD
operation: Freq
keyword: #p
keyword: freq=noraman
keyword: PBEPBE/SDD
title: #p freq=noraman PBEPBE/SDD
converged: YES YES NO NO
title: Mulliken charges:
elementType: P O O O N N C C C C C H H H H H H H H H H H H H H H
charge: 1.253525 -0.690727 -0.659061 -0.622942 -0.651949 -0.549698 -0.407472 -0.490101 -0.353026 -0.363411 -0.425227 0.208619 0.238725 0.302936 0.190121 0.241056 0.197609 0.176947 0.216051 0.201665 0.312718 0.323886 0.390427 0.411467 0.281472 0.266389
chargesum: 0.00000
title: Mulliken charges with hydrogens summed into heavy atoms:
elementType: P O O O N N C C C C C
charge: 1.253525 -0.300301 -0.247594 -0.622942 -0.015345 -0.001837 0.039873 -0.187164 0.078151 0.011145 -0.007510
polarizability: 1.13899693e+02 -1.89562295e+00 1.04432019e+02 2.45844645e+00 1.89814626e-01 8.50499275e+01
1716.lowfreq: -21.2174 -11.7657 -3.7033 -0.0014 -0.0009 0.0004 21.0917 24.7106 41.4674
frequency: 20.4298 23.9884 41.2115 109.4577 129.2877 130.3704 158.7927 187.9623 214.8044 230.8801 246.2231 267.9487 294.0283 314.3480 332.5430 351.7169 389.9957 432.5407 459.8177 516.6089 590.8457 622.9615 676.6986 735.3303 747.2641 757.5973 818.6039 824.9514 849.6337 927.4966 961.9830 989.9285 1001.4897 1029.1726 1045.4883 1068.0261 1091.1434 1106.0493 1122.2581 1174.9758 1185.9079 1202.0867 1254.0874 1271.5371 1290.7064 1307.6558 1318.2075 1337.5568 1343.7414 1351.3455 1371.8278 1455.3732 1457.1098 1461.9489 1484.5602 1623.7375 1645.4491 2949.2863 2954.0407 2961.9429 2977.8949 3004.2515 3010.2844 3023.7517 3038.3619 3044.4154 3082.6003 3455.4766 3457.1270 3580.4563 3582.3464 3597.2315
redmass: 4.4438 4.8922 3.4236 3.0824 2.4874 1.8752 3.7760 4.1489 2.5195 2.7688 2.1338 1.5475 1.9407 3.8364 1.6336 2.4466 3.1263 3.0773 3.2933 2.5287 3.2439 1.5211 6.6960 1.6709 2.9697 1.3587 1.4085 1.1597 1.7283 1.8933 2.0534 1.3978 1.5918 3.2429 3.2900 1.6682 2.3677 1.5260 2.7634 1.3583 1.3954 1.6017 1.3565 1.3056 1.2771 1.1127 1.3344 1.1745 1.2828 1.3348 1.4641 1.0901 1.0873 1.0727 1.0929 1.0916 1.0890 1.0595 1.0606 1.0642 1.0642 1.0927 1.0944 1.0907 1.1032 1.1036 1.0624 1.0454 1.0449 1.0974 1.0987 1.0661
irintensity: 1.9302 1.9112 1.9063 0.3664 5.1120 0.4471 1.8477 21.8434 38.0822 3.8253 27.0523 24.7966 15.1065 23.9625 4.2983 98.4390 46.3802 10.4199 7.9271 49.2163 16.5639 346.1979 120.7648 5.8165 177.2661 114.8806 3.8914 226.2028 17.2545 11.4114 8.5364 32.3443 0.6498 147.4651 3.6367 3.3148 5.0070 10.4633 8.7277 141.9711 38.5157 9.9403 1.9989 1.1053 5.5984 4.6945 0.5478 1.6034 2.6994 7.4604 5.0578 1.8547 6.5273 4.0279 10.2937 60.0556 30.1297 21.9517 21.3562 51.1909 38.7250 36.9557 10.5184 7.5740 30.9080 86.5603 171.2984 3.4708 1.7601 0.7864 11.9759 46.4969
temp: 298.150 k
press: 1.00000 atm
elementType: 15 8 8 8 7 7 6 6 6 6 6 1 1 1 1 1 1 1 1 1 1 1 1 1 1 1
symmnumber: 1
zpe: 562706.4 jmol-1
zpe.correction: 0.214324 hartree
zpe.thermalcorrener: 0.229162 hartree
zpe.thermalcorrenthalpy: 0.230106 hartree
zpe.thermalcorrgfe: 0.170945 hartree
zpe.sumelectzpe: -874.991001 hartree
zpe.sumelectthermal: -874.976162 hartree
zpe.sumelectthermalent: -874.975218 hartree
zpe.sumelectthermalfe: -875.034379 hartree
dipole: -1.7969 5.6241 -1.6685
dipole: 6.1354
quadrupole: -81.6088 -70.7636 -78.2230
quadrupole: 1.1520 8.4368 2.8367
quadrupole: -4.7437 6.1015 -1.3579 1.1520 8.4368 2.8367
hfenergy: -875.2053243 hartree
pointgroup: C01 [X(C5H15N2O3P1)]
dipole: 0.8647405 -2.0051858 -1.0286998 debye
dipolederiv: 1.7163279 0.0920425 -0.1035146 0.103722 1.5342688 -0.2137103 -0.0763882 -0.3549727 1.4261551 -0.8926206 -0.192716 0.2128043 -0.1393498 -0.6578351 0.2793311 0.245785 0.3679334 -0.8328459 -0.8650315 0.078075 -0.1707838 0.0486073 -0.7660411 0.0610038 -0.1714591 0.065188 -0.6931288 -0.7665549 -0.087103 0.0537141 0.0278359 -0.7505615 -0.0398778 0.0485863 -0.0427753 -0.5791809 -0.7015995 0.1470933 -0.1441998 0.1063274 -0.5635308 -0.1515287 -0.1263741 -0.121367 -0.4503919 -0.7915091 0.326126 -0.0247257 0.3694861 -0.6904977 -0.0813369 -0.0938072 -0.0484341 -0.229418 -0.0341953 0.1006328 0.0364783 -0.0428593 0.089938 0.0598089 -0.0211591 -0.0208142 0.0905763 0.1771162 -0.1180352 0.0628075 -0.2026782 0.3751727 0.0140299 -0.0878824 0.0851334 0.0601282 -0.0406275 -0.0081333 0.0499872 0.0203959 -0.0390375 0.0155163 0.0562318 0.0509194 0.1420614 -0.1074281 0.1256086 0.0084794 0.1366284 0.0522177 0.013005 -0.0798259 0.0440655 0.1307028 0.3986772 -0.073323 0.0303612 -0.2074809 0.5322538 0.0868847 0.0572685 0.0862008 0.2497713 0.0239098 -0.0261884 -0.000694 -0.0038085 -0.1878263 -0.0543492 0.0323863 -0.0561301 0.0592024 0.0551049 0.0016179 -0.043514 0.0050266 0.0822778 -0.005822 -0.0291592 0.036285 -0.1074685 0.0061305 0.0150392 -0.0712871 0.0233134 -0.0079966 -0.0024638 -0.042887 0.0033666 -0.0909746 0.0207137 0.007115 -0.0240352 0.0050357 0.0698208 -0.0001273 -0.0252105 0.0118896 -0.1807075 0.163217 0.0100254 -0.0096787 0.0003429 -0.0510115 -0.0039233 -0.0076475 -0.0120232 0.0566977 0.0180278 0.0113187 -0.0537678 -0.0124509 0.0708764 -0.0069915 -0.0251888 0.0313253 -0.179835 0.0090887 0.0152484 0.0144543 -0.0398313 -0.2328819 -0.0538192 0.0169152 -0.0952608 0.0444809 -0.1533494 -0.0824021 0.077197 -0.0776567 -0.044617 0.028294 0.1088508 0.0681407 0.0449656 0.0623398 0.032374 -0.0159816 0.0367082 0.0219788 -0.0080026 -0.0771735 -0.0341017 -0.187671 0.2284365 -0.0675124 0.0461113 -0.0091341 0.0420698 0.0194028 0.051381 -0.0607318 0.2624505 0.1768002 0.0242211 0.0583977 0.0526063 0.2017748 0.053347 0.1184206 0.0413577 0.1728522 0.3768831 -0.0399504 0.0127884 -0.0325484 0.1574906 -0.0958739 0.0155329 -0.0771857 0.3061706 0.350995 0.0538594 0.0380887 0.048917 0.4004979 0.0661114 0.0344449 0.0999856 0.3331759 0.2140493 -0.227742 0.0970207 -0.1470588 0.1949762 -0.0203485 0.1133449 -0.0470272 0.1457492 0.3550984 -0.1172915 -0.1365077 -0.0700962 0.1662228 0.0414402 -0.0349861 -0.0209673 0.0064821 unknown
polarizability: 113.3071846|-0.13538|103.9152559|-5.6367378|2.0168301|86.1591985 unknown
InChI: InChI=1S/C5H15N2O3P/c6-4-2-1-3-5(7)11(8,9)10/h5,8-9H,1-4,6-7H2
charge 0 multiplicity 1
26 atoms
P  1.551997 1.142967 -0.016713
O  2.473923 1.742663 -1.374433
O  2.714079 0.674295 1.169049
O  0.437119 2.147269 0.518484
N  2.359553 -1.388542 -0.548587
N  -3.97028 1.112625 0.608465
C  -0.086659 -1.195903 -0.046502
C  1.136386 -0.581169 -0.7569
C  -1.409792 -0.464199 -0.366832
C  -2.620305 -1.067843 0.37649
C  -3.937719 -0.277969 0.11814
H  -0.16859 -2.256131 -0.368756
H  0.078101 -1.203778 1.049891
H  0.904774 -0.399846 -1.823323
H  -1.596345 -0.501509 -1.460882
H  -1.304523 0.60246 -0.089156
H  -2.417392 -1.077305 1.467906
H  -2.764621 -2.125195 0.066207
H  -4.781008 -0.822971 0.584206
H  -4.141109 -0.260451 -0.971107
H  2.17328 -2.366556 -0.304033
H  3.059423 -1.294373 -1.292501
H  2.749678 2.69124 -1.302127
H  2.997255 -0.264533 0.879223
H  -3.319392 1.748911 0.137595
H  -3.903631 1.198444 1.627796
