program: Gaussian 09
title: 000281217
version: EM64L-G09RevD.01
frameworkgroup: C1[X(C7H18NO3P)]
method: RPBEPBE
basis: SDD
operation: Freq
keyword: #p
keyword: freq=noraman
keyword: PBEPBE/SDD
title: #p freq=noraman PBEPBE/SDD
converged: YES YES NO NO
title: Mulliken charges:
elementType: P O O O N C C C C C C C H H H H H H H H H H H H H H H H H H
charge: 1.185920 -0.689717 -0.682397 -0.636447 -0.546843 -0.357772 -0.356694 -0.475970 -0.372975 -0.353345 -0.356367 -0.695997 0.241015 0.230928 0.186823 0.222967 0.290050 0.192311 0.191471 0.189623 0.188201 0.195554 0.195211 0.298342 0.307006 0.215674 0.209870 0.209823 0.387022 0.386711
chargesum: 0.00000
title: Mulliken charges with hydrogens summed into heavy atoms:
elementType: P O O O N C C C C C C C
charge: 1.185920 -0.302694 -0.295686 -0.636447 0.058506 0.114171 0.053097 -0.185920 0.010806 0.024480 0.034398 -0.060631
polarizability: 1.52820572e+02 3.77177710e+00 1.09895649e+02 2.22980534e+00 8.57853605e-01 9.87273810e+01
1716.lowfreq: -8.7123 -4.3873 -0.0014 -0.0012 0.0018 11.2371 29.6603 42.6055 44.9771
frequency: 29.4385 42.3290 44.9245 61.2807 94.6845 110.7862 117.5516 129.1010 148.6496 177.2395 190.5506 199.8533 227.2280 258.5473 269.2896 323.3158 334.8635 342.8935 366.5106 396.0271 427.0436 440.0476 505.2379 584.1994 619.1981 699.4023 724.9323 736.1748 744.1482 794.9541 872.0049 887.7918 929.8804 965.8518 973.6751 976.9110 1010.4012 1030.9682 1053.4651 1064.1281 1068.8912 1080.2514 1114.9061 1160.0952 1185.9480 1214.1330 1230.0324 1244.9990 1270.2324 1286.0081 1291.3063 1297.3308 1312.2475 1337.9783 1354.8502 1358.1248 1366.6518 1389.3198 1463.1119 1465.0981 1469.2782 1475.6820 1476.8665 1484.2040 1489.0730 1644.0078 2952.1683 2956.3044 2966.0444 2969.6060 2971.7404 2988.7270 2993.9955 3005.9635 3026.2352 3035.1617 3041.8866 3064.1979 3068.3058 3070.6352 3492.7908 3571.2883 3582.5369 3623.8423
redmass: 3.8720 1.9098 4.5019 3.4904 2.9269 3.5872 1.9878 2.8898 1.9254 6.0933 2.3090 3.4532 1.1266 3.9964 3.3906 2.5637 2.5437 1.2403 1.5031 3.3429 3.7105 2.5361 2.3358 1.5636 4.9925 6.7954 1.0687 5.2233 1.1725 1.2120 1.3621 1.8739 2.3043 2.1078 1.1855 1.2130 3.3948 2.9391 1.1754 2.4707 2.7203 2.2273 2.3561 2.3362 1.8503 1.4490 1.3526 1.2949 1.2640 1.0561 1.1808 1.2259 1.2199 1.3766 1.6295 1.4460 1.4272 1.2174 1.0715 1.0719 1.0701 1.0729 1.0425 1.0807 1.0936 1.0965 1.0588 1.0592 1.0612 1.0610 1.0367 1.0967 1.0613 1.0996 1.1005 1.0913 1.0972 1.1023 1.1007 1.0993 1.0448 1.0660 1.0661 1.1001
irintensity: 0.2321 0.0145 0.1638 0.1420 0.0969 0.4051 0.0523 5.5871 3.5815 13.0645 3.7480 6.4534 0.0326 24.7202 39.3176 65.9687 132.0256 18.1807 147.9736 8.8456 3.7033 3.9361 9.7927 183.0656 295.2153 180.5726 8.9356 106.9679 7.0738 2.4141 1.6212 4.5809 8.0060 4.6915 43.5696 1.4725 0.0645 3.7641 0.3543 110.4367 27.5661 4.9754 33.4518 27.5189 1.3559 3.1217 19.3137 6.5688 3.7681 0.0435 4.3006 3.6088 2.2768 6.6356 4.0212 8.9430 3.5011 10.7752 0.2695 0.0809 2.2349 2.6618 12.2870 1.1526 28.9018 61.3228 0.0954 9.9738 5.9143 118.8017 36.9384 0.5584 18.1268 2.2927 11.6117 31.9271 28.5027 28.9990 112.2499 54.5212 16.1215 29.7431 31.9092 12.8890
temp: 298.150 k
press: 1.00000 atm
elementType: 15 8 8 8 7 6 6 6 6 6 6 6 1 1 1 1 1 1 1 1 1 1 1 1 1 1 1 1 1 1
symmnumber: 1
zpe: 662836.1 jmol-1
zpe.correction: 0.252461 hartree
zpe.thermalcorrener: 0.269455 hartree
zpe.thermalcorrenthalpy: 0.270399 hartree
zpe.thermalcorrgfe: 0.206596 hartree
zpe.sumelectzpe: -898.181462 hartree
zpe.sumelectthermal: -898.164468 hartree
zpe.sumelectthermalent: -898.163524 hartree
zpe.sumelectthermalfe: -898.227327 hartree
dipole: 1.0694 0.1329 0.8447
dipole: 1.3692
quadrupole: -91.4082 -78.5810 -80.1437
quadrupole: 4.2337 -6.6440 2.7351
quadrupole: -8.0306 4.7966 3.2339 4.2337 -6.6440 2.7351
hfenergy: -898.4339228 hartree
pointgroup: C01[X(C7H18N1O3P1)]
dipole: 0.4193783 -0.0231262 -0.337304 debye
polarizability: 152.6724289|-4.2350363|109.7115072|-2.7537896|2.0981651|99.059666 unknown
InChI: InChI=1S/C7H18NO3P/c1-2-3-4-5-6-7(8)12(9,10)11/h7,9-10H,2-6,8H2,1H3
charge 0 multiplicity 1
30 atoms
P  -3.217708 0.324357 0.168682
O  -3.163499 0.552986 -1.565445
O  -2.85458 1.889283 0.860523
O  -4.626141 -0.261473 0.65357
N  -1.657852 -1.960559 -0.25131
C  -0.374062 0.167385 -0.087802
C  0.976365 -0.452207 0.339536
C  -1.570418 -0.676346 0.397316
C  2.184202 0.350568 -0.193832
C  3.543631 -0.235833 0.249146
C  4.755536 0.563186 -0.282323
C  6.110028 -0.025391 0.168122
H  -0.462886 1.190346 0.323779
H  -0.421925 0.26203 -1.190857
H  1.026143 -0.492963 1.447901
H  1.029453 -1.498533 -0.01758
H  -1.519552 -0.813048 1.493073
H  2.143221 0.383109 -1.302774
H  2.110366 1.403494 0.150336
H  3.620423 -1.288521 -0.09518
H  3.586219 -0.268237 1.358117
H  4.675833 1.615296 0.060092
H  4.714041 0.593557 -1.390404
H  -1.687298 -1.934345 -1.273322
H  -2.274401 -2.658022 0.169701
H  6.95921 0.565146 -0.222475
H  6.188131 -0.040608 1.271764
H  6.229143 -1.065685 -0.189726
H  -4.056306 0.680695 -1.977144
H  -3.654817 2.366333 1.201814
