program: Gaussian 09
title: 000281239
version: EM64L-G09RevD.01
frameworkgroup: C1[X(C13H19O5P)]
method: RPBEPBE
basis: SDD
operation: Freq
keyword: #p
keyword: freq=noraman
keyword: PBEPBE/SDD
title: #p freq=noraman PBEPBE/SDD
converged: YES YES NO NO
title: Mulliken charges:
elementType: P O O O O O C C C C C C C C C C C C C H H H H H H H H H H H H H H H H H H H
charge: 1.296125 -0.507966 -0.526655 -0.228105 -0.607315 -0.255365 -0.846944 0.354420 -0.232440 -0.257778 -0.485306 0.465617 -0.660761 -0.649312 -0.376730 -0.364761 -0.225029 -0.228280 -0.230665 0.311088 0.291913 0.217940 0.250814 0.225565 0.241787 0.234422 0.243385 0.238103 0.228048 0.206216 0.218741 0.249026 0.217184 0.237285 0.265343 0.229556 0.229555 0.231280
chargesum: 0.00000
title: Mulliken charges with hydrogens summed into heavy atoms:
elementType: P O O O O O C C C C C C C C C C C C C
charge: 1.296125 -0.507966 -0.526655 -0.228105 -0.607315 -0.255365 -0.243943 0.354420 0.236313 0.209574 -0.007500 0.465617 0.011606 0.035639 -0.139445 -0.099418 0.004528 0.001275 0.000615
polarizability: 2.33397056e+02 -7.43369974e+00 1.74058186e+02 -1.20263969e+01 -1.55814605e+01 1.36808101e+02
1716.lowfreq: -23.8748 -0.0017 -0.0016 -0.0013 2.6365 6.0703 16.1319 21.3267 26.6661
frequency: -19.4129 21.1723 26.2627 30.7325 38.0239 46.4084 62.2561 64.5433 99.1204 111.3107 123.7202 140.3534 167.8094 184.6761 199.2378 226.8670 238.1658 242.7214 280.8293 311.2334 328.5587 346.9974 364.0524 404.0450 411.9396 413.9437 443.1104 486.6155 544.1430 584.6881 610.3327 617.9616 662.2366 678.3221 704.4974 744.3209 762.6296 792.4489 804.2829 815.0870 818.0566 859.1957 859.9534 872.1746 898.7682 919.3570 939.5571 978.3783 984.1462 990.5081 1002.0347 1012.2342 1018.8839 1027.5381 1040.8551 1092.0940 1092.3534 1102.5084 1118.9713 1134.3254 1146.9334 1174.4284 1190.0929 1223.4645 1226.4914 1237.8819 1250.5323 1258.8072 1273.8817 1330.5358 1348.2946 1354.9551 1360.7240 1386.4457 1391.7268 1392.6553 1408.8570 1443.5890 1456.2901 1460.2829 1461.5044 1466.7187 1477.4519 1482.2785 1485.5905 1489.4176 1595.1389 1615.4369 1620.2468 2985.5588 2986.4319 2993.9275 3009.3642 3043.4115 3053.6729 3061.5487 3076.9599 3082.7759 3090.2263 3105.0487 3109.6900 3119.9959 3122.7494 3129.5667 3141.4675 3143.1380 3152.3661 3166.2955
redmass: 2.6193 4.5798 4.6378 4.0206 5.0119 2.8006 4.1549 4.4977 2.6955 4.3273 3.7733 4.4477 5.4383 3.0773 3.3952 2.8940 1.9509 1.4117 3.6141 4.4039 5.6593 2.0804 4.6352 2.8141 3.1588 4.3571 4.0695 3.9200 6.9140 4.8725 5.7056 6.2134 5.9871 6.4902 1.8485 2.3782 6.0483 3.1209 1.1296 1.0953 3.4977 1.5798 2.1420 3.6815 2.2459 3.6338 1.6282 1.9177 1.4318 5.5957 1.3313 2.6709 3.0646 2.2146 4.7325 2.1405 1.5181 2.1292 2.0482 1.4189 1.5768 1.0542 1.1205 2.4521 1.5589 1.3428 1.4131 1.1567 1.1135 1.2607 1.3039 1.2153 1.2353 8.2070 1.2422 1.2279 1.1077 2.1850 1.0402 1.1288 1.0421 1.0706 1.0524 1.0545 2.3159 1.0863 6.1113 6.0983 9.0787 1.0364 1.0535 1.0380 1.0616 1.0587 1.1083 1.0572 1.1025 1.0978 1.0979 1.1047 1.1022 1.1038 1.0903 1.0876 1.0921 1.1065 1.0965 1.1016
irintensity: 0.2101 1.2694 0.4548 0.5502 0.1993 0.6016 0.4865 1.8736 6.0653 1.4642 1.2611 6.9556 0.4573 5.7223 1.4600 6.4037 8.4344 0.5309 22.7770 6.1699 10.9548 5.5534 28.4083 0.0859 10.7675 10.3330 19.4668 23.8572 10.0223 20.6841 83.2405 0.8172 79.6273 67.8801 52.4864 88.6663 41.2294 15.5158 4.1365 4.5552 8.2591 50.2228 98.6927 98.1267 29.0752 72.7975 2.8955 13.3161 1.3975 0.3690 0.6093 129.3484 185.7596 3.9358 67.4135 14.3066 8.3605 19.5215 226.6260 3.6098 20.4058 0.0056 2.2552 74.1233 56.2826 103.6861 148.9320 0.8290 0.4602 1.5797 14.1255 8.6319 1.1033 0.9534 25.7999 22.3925 28.1650 9.4452 11.1225 15.0704 13.4118 3.7598 2.4476 16.5491 8.2220 7.2172 3.3293 0.6220 150.6232 14.4393 24.6467 27.8904 32.7193 23.0717 6.8646 0.4948 3.9572 40.1225 26.1256 34.1384 31.0804 1.6964 5.8020 1.1634 16.9806 0.3432 26.7507 21.2390
temp: 298.150 k
press: 1.00000 atm
elementType: 15 8 8 8 8 8 6 6 6 6 6 6 6 6 6 6 6 6 6 1 1 1 1 1 1 1 1 1 1 1 1 1 1 1 1 1 1 1
symmnumber: 1
zpe: 792420.7 jmol-1
zpe.correction: 0.301817 hartree
zpe.thermalcorrener: 0.322588 hartree
zpe.thermalcorrenthalpy: 0.323532 hartree
zpe.thermalcorrgfe: 0.248853 hartree
zpe.sumelectzpe: -1222.654472 hartree
zpe.sumelectthermal: -1222.633702 hartree
zpe.sumelectthermalent: -1222.632757 hartree
zpe.sumelectthermalfe: -1222.707437 hartree
dipole: 0.6696 1.0329 -2.8400
dipole: 3.0953
quadrupole: -95.2829 -118.1584 -123.5247
quadrupole: -5.9131 7.5892 2.2747
quadrupole: 17.0391 -5.8364 -11.2027 -5.9131 7.5892 2.2747
hfenergy: -1222.9562893 hartree
pointgroup: C01 [X(C13H19O5P1)]
dipole: -0.3392074 -0.0010338 1.1695799 debye
polarizability: 235.0837667|4.8237803|157.8489531|-1.7340562|24.8803926|151.3306235 unknown
InChI: InChI=1S/C13H19O5P/c1-3-17-19(15,18-4-2)11-13(14)16-10-12-8-6-5-7-9-12/h5-9H,3-4,10-11H2,1-2H3
charge 0 multiplicity 1
38 atoms
P  2.381012 -0.914886 -0.084177
O  2.813224 0.761362 -0.001727
O  3.33833 -1.733867 1.125165
O  -1.060296 -0.539177 -0.699064
O  2.528138 -1.475386 -1.561906
O  -0.46244 1.052398 0.907134
C  0.711652 -1.10548 0.788719
C  -0.314212 -0.073375 0.371891
C  2.868139 1.474694 1.314932
C  4.629437 -2.345686 0.68684
C  -2.105967 0.402259 -1.261841
C  -3.447663 0.189572 -0.599037
C  3.497465 2.833987 1.025121
C  5.752521 -1.307494 0.602695
C  -4.373166 -0.740427 -1.137256
C  -3.796042 0.918166 0.567968
C  -5.626356 -0.944516 -0.518306
C  -5.048968 0.71503 1.186908
C  -5.966499 -0.216159 0.64559
H  0.36851 -2.124103 0.552101
H  0.920717 -1.011009 1.864972
H  3.477866 0.881196 2.023073
H  1.8370 1.580226 1.700881
H  4.826655 -3.102864 1.463585
H  4.471398 -2.848522 -0.286056
H  -2.117513 0.128938 -2.327875
H  -1.733672 1.43165 -1.125554
H  2.891053 3.389488 0.290255
H  4.516889 2.716446 0.619955
H  3.552269 3.429274 1.955809
H  5.876856 -0.783383 1.566523
H  5.545657 -0.560418 -0.183705
H  6.706997 -1.809482 0.35618
H  -4.109439 -1.30569 -2.039595
H  -3.076853 1.630076 0.988459
H  -6.335536 -1.664029 -0.942229
H  -5.311085 1.282125 2.086987
H  -6.939478 -0.371434 1.125283
