program: Gaussian 09
title: 000281249
version: EM64L-G09RevD.01
frameworkgroup: C1[X(C12H23O6P)]
method: RPBEPBE
basis: SDD
operation: Freq
keyword: #p
keyword: freq=noraman
keyword: PBEPBE/SDD
title: #p freq=noraman PBEPBE/SDD
converged: YES YES NO NO
title: Mulliken charges:
elementType: P O O O O O O C C C C C C C C C C C C H H H H H H H H H H H H H H H H H H H H H H H
charge: 1.263500 -0.535549 -0.478738 -0.244763 -0.609914 -0.236233 -0.244769 -0.438706 0.335391 0.217494 -0.228326 -0.258660 -0.766902 -0.230948 -0.654306 -0.647636 -0.254686 -0.694806 -0.666042 0.224986 0.218819 0.222621 0.236790 0.246639 0.248339 0.294634 0.237133 0.240564 0.220666 0.267925 0.205751 0.247533 0.221814 0.209278 0.237564 0.226940 0.232528 0.232429 0.211155 0.245629 0.221972 0.222892
chargesum: 0.00000
title: Mulliken charges with hydrogens summed into heavy atoms:
elementType: P O O O O O O C C C C C C C C C C C C
charge: 1.263500 -0.535549 -0.478738 -0.244763 -0.609914 -0.236233 -0.244769 -0.438706 0.335391 0.217494 0.215479 0.200750 0.022710 0.246749 0.040036 0.030989 0.209817 -0.018694 0.024450
polarizability: 2.01484511e+02 -6.45679123e+00 1.83626280e+02 1.08210074e+00 2.42476849e+00 1.56478221e+02
1716.lowfreq: -19.5791 -6.4667 -0.0018 -0.0010 -0.0005 3.8688 8.8601 15.0366 25.1694
frequency: -19.2402 12.7714 25.0979 30.6644 44.6998 58.4643 62.7625 69.6178 86.6725 94.9608 96.9956 102.2200 121.0236 147.4068 150.9464 162.0357 182.9715 185.7387 193.4207 220.8645 232.6467 243.4223 245.8626 255.6343 276.9191 301.4928 308.8205 327.0721 352.0123 397.3354 422.6418 424.8940 458.2950 478.9720 509.6715 521.9680 600.7570 632.3037 653.5988 681.1059 723.0861 791.0579 802.2147 806.9958 815.4457 822.9197 827.1322 858.8242 864.8512 947.4121 983.3684 1009.2732 1014.3339 1015.1400 1026.5368 1036.5537 1050.2335 1066.9354 1093.2049 1093.6776 1095.5178 1118.8669 1134.3739 1146.9422 1148.6276 1156.5412 1165.7524 1250.3832 1266.3476 1268.0607 1272.0455 1276.5491 1349.2168 1350.7922 1353.5954 1372.7522 1386.6844 1388.0957 1388.7788 1400.0791 1410.5569 1453.0019 1455.6879 1457.5971 1461.1746 1461.8522 1465.4978 1468.3276 1471.3229 1478.0308 1481.5778 1485.5671 1486.2112 1489.2300 1492.4636 1582.5922 1611.4406 2986.9451 2987.4379 2991.4223 2992.3270 2994.7187 2996.6680 3000.0480 3000.5577 3031.8875 3067.9556 3069.0501 3072.2778 3082.4866 3083.5980 3085.0298 3086.9362 3093.4118 3094.4184 3108.4551 3109.4490 3111.7933 3112.4939 3120.2708
redmass: 2.7652 3.5806 3.6446 3.5135 3.5254 3.0582 2.6580 2.5263 1.7887 2.9190 2.1424 1.9271 4.2014 2.8943 3.1605 3.2139 3.0765 4.4815 4.3367 1.9528 1.3313 1.6009 1.3000 1.6975 2.8774 4.2103 3.2779 3.3564 4.9462 4.0770 3.8001 3.7451 3.6757 4.3705 4.4589 5.7651 6.8771 6.9600 7.0868 9.1795 3.5609 2.3212 1.1231 1.1145 1.6438 3.0818 1.1008 3.6081 3.5369 3.8287 3.6535 2.8634 2.8971 3.0795 3.5171 5.2927 1.5615 2.4322 2.1327 2.1628 2.1331 2.3565 1.4590 1.5333 1.5664 1.6726 6.1800 4.0612 1.1729 1.1185 1.1240 1.1183 1.2192 1.2198 1.2889 1.3409 1.2269 1.2370 1.2291 1.2630 1.1975 1.0854 1.0949 1.0408 1.0417 1.0396 1.0438 1.0756 1.0735 1.0498 1.0645 1.0551 1.0558 1.0534 1.0800 7.9111 7.9177 1.0366 1.0372 1.0359 1.0605 1.0376 1.0369 1.0613 1.0549 1.0595 1.1027 1.1077 1.1037 1.0976 1.0974 1.0976 1.0969 1.1022 1.0986 1.1025 1.1027 1.1028 1.1013 1.1069
irintensity: 0.6368 0.6130 2.1745 0.2524 0.3495 0.6315 0.2081 0.3354 0.9179 0.6970 1.8050 0.4082 1.2861 5.0569 3.1657 1.6702 6.0515 12.4127 0.3698 5.0368 1.7851 4.8705 2.0117 3.8588 4.5386 16.9721 2.1567 8.2793 1.9486 14.9027 8.1448 14.0707 6.9261 1.8458 16.0532 36.1897 142.3783 55.0953 58.1354 45.7844 18.1789 6.2271 4.1353 6.6176 2.2089 14.2983 6.6542 83.5993 145.7012 42.7209 4.4776 124.4810 108.4935 81.7239 103.0076 79.1035 8.9027 71.8493 21.1420 10.7029 13.5830 25.0737 2.6234 6.8060 9.2961 10.7922 216.9858 379.7676 20.6638 1.7837 2.7450 4.9581 13.4875 9.1028 8.5712 0.5604 29.5745 20.9081 36.8761 21.4859 38.4102 12.1999 22.0768 10.7985 10.2005 12.7995 13.8671 3.8137 2.0130 11.5973 17.4274 24.8632 11.4383 11.6953 15.3731 172.5100 274.1053 26.9211 20.1584 18.4098 22.5771 12.6267 22.1862 38.2972 15.3058 22.0223 8.3551 4.3808 9.1497 25.9119 41.4858 37.3092 7.7061 5.6606 18.6422 34.6372 32.0657 20.7354 2.2725 29.0483
temp: 298.150 k
press: 1.00000 atm
elementType: 15 8 8 8 8 8 8 6 6 6 6 6 6 6 6 6 6 6 6 1 1 1 1 1 1 1 1 1 1 1 1 1 1 1 1 1 1 1 1 1 1 1
symmnumber: 1
zpe: 896037.2 jmol-1
zpe.correction: 0.341283 hartree
zpe.thermalcorrener: 0.365699 hartree
zpe.thermalcorrenthalpy: 0.366643 hartree
zpe.thermalcorrgfe: 0.284514 hartree
zpe.sumelectzpe: -1262.066704 hartree
zpe.sumelectthermal: -1262.042288 hartree
zpe.sumelectthermalent: -1262.041344 hartree
zpe.sumelectthermalfe: -1262.123473 hartree
dipole: 3.2223 3.0206 2.2996
dipole: 4.9795
quadrupole: -110.6505 -112.6423 -129.2315
quadrupole: -5.7234 -6.6472 -6.0337
quadrupole: 6.8576 4.8658 -11.7234 -5.7234 -6.6472 -6.0337
hfenergy: -1262.4079866 hartree
pointgroup: C01 [X(C12H23O6P1)]
dipole: -0.9156484 -1.2654051 1.1825205 debye
polarizability: 203.4823835|0.1368849|179.0428108|2.0191263|-7.9572578|159.0638175 unknown
InChI: InChI=1S/C12H23O6P/c1-6-15-10(5)11(12(13)16-7-2)19(14,17-8-3)18-9-4/h6-9H2,1-5H3
charge 0 multiplicity 1
42 atoms
P  1.408469 1.038638 -0.832134
O  2.275962 -0.215012 0.000526
O  1.648338 2.489088 0.11014
O  -2.713327 0.814642 -0.972077
O  1.889262 1.33382 -2.321743
O  -0.265911 -1.929108 -0.177735
O  -0.520798 -0.592339 1.714044
C  -0.313171 0.439698 -0.498515
C  -1.363311 1.112535 -1.087749
C  -0.393887 -0.705073 0.467746
C  3.741288 -0.346021 -0.260194
C  1.173777 2.567433 1.524003
C  -1.217662 2.336181 -1.965838
C  -3.218085 -0.340338 -0.174839
C  4.009811 -1.209196 -1.49561
C  2.236601 2.07085 2.508396
C  -0.135287 -3.134968 0.703077
C  -4.730125 -0.363432 -0.370478
C  -1.507781 -3.676702 1.112945
H  4.188007 0.66144 -0.366308
H  4.125385 -0.812584 0.662932
H  0.967472 3.642788 1.660799
H  0.229327 1.999897 1.639693
H  -1.960886 2.284602 -2.778481
H  -1.423525 3.24833 -1.37643
H  -0.211497 2.419227 -2.406085
H  -2.740973 -1.26299 -0.552558
H  -2.943805 -0.190443 0.885229
H  3.51756 -2.192244 -1.396075
H  3.63168 -0.710651 -2.403633
H  5.098518 -1.373375 -1.608742
H  2.410712 0.988792 2.384249
H  3.188231 2.610104 2.357852
H  1.895114 2.250186 3.545577
H  0.466703 -2.853468 1.584459
H  0.419765 -3.847064 0.072169
H  -5.186192 0.575968 -0.014435
H  -4.987982 -0.495606 -1.43491
H  -5.167347 -1.201361 0.202481
H  -2.038786 -2.953906 1.754863
H  -2.126106 -3.902848 0.226601
H  -1.37814 -4.613291 1.686386
