program: Gaussian 09
title: 000281193
version: EM64L-G09RevD.01
frameworkgroup: C1[X(C12H11NO2)]
method: RPBEPBE
basis: SDD
operation: Freq
keyword: #p
keyword: freq=noraman
keyword: PBEPBE/SDD
title: #p freq=noraman PBEPBE/SDD
converged: YES YES NO NO
title: Mulliken charges:
elementType: O O N C C C C C C C C C C C C H H H H H H H H H H H
charge: -0.288082 -0.263929 -0.015779 0.272669 0.156426 -0.069690 -0.363744 -0.268238 -0.303237 0.203271 -0.243429 -0.223680 -0.375434 -0.257050 -0.664718 0.299668 0.272853 0.263539 0.231376 0.233898 0.243258 0.235839 0.224642 0.219928 0.227803 0.251840
chargesum: 0.00000
title: Mulliken charges with hydrogens summed into heavy atoms:
elementType: O O N C C C C C C C C C C C C
charge: -0.288082 -0.263929 -0.015779 0.272669 0.156426 -0.069690 -0.064076 0.004615 -0.039698 0.203271 -0.012053 0.010218 -0.132176 0.203430 0.034853
polarizability: 2.04592193e+02 1.59624135e+01 1.66722611e+02 -5.68306693e+00 1.28301986e+00 6.76557713e+01
1716.lowfreq: -6.9079 0.0006 0.0010 0.0010 2.0944 7.9963 22.3384 57.3263 79.3606
frequency: 22.0282 57.3064 79.3318 113.7185 148.6240 177.3639 216.4730 225.7692 267.4908 321.6913 364.8782 402.5912 429.3229 466.9212 469.0852 523.6393 526.8116 555.7153 633.2539 640.8680 722.1437 729.3163 776.4106 788.0309 800.7062 808.5719 819.4733 857.4206 875.8288 899.9206 961.9744 980.5867 985.8610 1010.2073 1016.6701 1026.5843 1075.5525 1094.7837 1110.3291 1149.0160 1154.8784 1180.9230 1220.2407 1238.2662 1270.1728 1279.7335 1333.7262 1355.9566 1371.1062 1382.6061 1391.4188 1429.0943 1450.2580 1456.5115 1463.4416 1484.9291 1503.3791 1545.7944 1568.2389 1613.7707 1619.6754 2994.0658 3031.4892 3089.2852 3094.7296 3120.3681 3131.6909 3133.8027 3151.3531 3172.4053 3186.8194 3192.4235
redmass: 4.3137 3.5490 4.8176 4.4076 2.4804 4.3461 4.8030 1.3203 5.3976 3.0313 8.3703 3.7344 3.4910 3.2260 4.9238 6.4193 5.6831 6.9004 3.5918 6.2774 3.5561 3.8683 2.8414 1.5409 3.3236 5.2158 1.6000 4.2803 1.2969 1.6176 4.1825 1.4360 1.3587 1.3167 3.0824 2.4259 2.3783 2.1894 3.0000 1.4679 1.6691 1.3251 2.2154 2.1055 1.7544 1.1265 4.6921 1.2758 3.0609 2.0086 1.2323 2.6456 2.5731 1.1158 1.0442 1.0522 3.8279 6.8050 7.3307 8.1513 6.8780 1.0361 1.0593 1.0973 1.1034 1.1061 1.0909 1.0867 1.0916 1.0976 1.0956 1.0939
irintensity: 0.9699 0.5302 0.3909 2.9073 1.0130 5.8855 0.4799 2.8913 1.9352 18.5131 1.8686 5.9386 2.3462 0.7658 4.2609 5.2489 7.6905 4.4984 1.4366 9.4236 0.0709 5.8938 4.7455 86.9268 6.3788 0.1826 0.8020 8.2522 33.5108 1.5403 29.3753 0.5148 4.1289 0.8843 99.0649 20.6288 26.0781 66.0132 195.4038 90.3845 41.2491 25.8527 20.3021 169.2948 19.7842 1.2492 2.1193 4.4351 9.6165 2.0099 24.0241 3.2240 2.1654 20.1909 14.0188 14.0802 51.3300 20.7802 22.8936 84.9591 8.6991 20.6307 34.5338 37.4738 0.6356 29.1823 26.5267 7.3144 15.4455 13.3059 17.7021 1.8307
temp: 298.150 k
press: 1.00000 atm
elementType: 8 8 7 6 6 6 6 6 6 6 6 6 6 6 6 1 1 1 1 1 1 1 1 1 1 1
symmnumber: 1
zpe: 530811.9 jmol-1
zpe.correction: 0.202176 hartree
zpe.thermalcorrener: 0.214955 hartree
zpe.thermalcorrenthalpy: 0.215900 hartree
zpe.thermalcorrgfe: 0.161669 hartree
zpe.sumelectzpe: -668.022575 hartree
zpe.sumelectthermal: -668.009795 hartree
zpe.sumelectthermalent: -668.008851 hartree
zpe.sumelectthermalfe: -668.063082 hartree
dipole: 2.2565 -0.1932 0.0405
dipole: 2.2651
quadrupole: -71.1923 -85.4609 -89.7416
quadrupole: 9.1629 -0.5103 -0.5957
quadrupole: 10.9393 -3.3293 -7.6100 9.1629 -0.5103 -0.5957
hfenergy: -668.2247507 hartree
pointgroup: C01 [X(C12H11N1O2)]
dipole: 0.8887309 -0.0222185 0.0621241 debye
dipolederiv: -1.827761 -0.1733647 -0.1349113 -0.445002 -0.5112687 -0.0267429 -0.0581166 -0.0037806 -0.3307789 -0.7968584 0.1391203 0.0165303 -0.0346366 -0.8006498 -0.1139568 0.0001187 -0.0936174 -0.3289715 -0.2622216 0.0336132 0.0025829 0.1793974 -0.1796327 0.0095464 0.0332147 0.010159 -0.2390795 -0.2138267 -0.1358757 -0.018644 0.4269464 0.0363439 -0.004285 0.0842079 -0.0010609 0.0636436 -0.3898514 0.1899035 0.0301883 0.3210733 0.0308745 0.0020606 0.0641374 0.0034383 -0.0083339 0.1974765 0.3218096 0.054634 -0.0683071 -0.0377914 -0.0159844 -0.0162749 -0.0257397 0.054377 -0.123369 -0.0844183 -0.019442 -0.1671742 -0.0629668 0.0138463 -0.031917 0.0159554 -0.1387246 0.0240081 0.1799423 0.0242834 -0.1878877 -0.2792558 -0.036208 -0.0331775 -0.0480757 -0.0627937 0.0893003 -0.0726635 -0.0194922 -0.1031302 -0.0221455 0.0253604 -0.0252159 0.0246804 -0.1449935 2.1534492 -0.0155697 0.0221488 0.3444079 1.0297189 0.1917638 0.008657 0.1398386 0.2523007 -0.0316485 -0.0801639 -0.0166625 -0.0517008 0.1906514 0.0629495 -0.0126466 0.0630524 -0.1346958 0.1741389 0.1005867 0.0092367 0.0621409 -0.1106339 0.0050923 0.0021609 0.0038136 -0.1473198 -0.0810594 -0.2606527 -0.0465842 -0.0838556 0.400053 0.0823514 -0.014825 0.0923464 -0.0558033 1.0295264 0.007333 0.0899015 -0.1848425 0.2529274 -0.0376101 -0.0110278 -0.063433 0.328621 -0.1315901 0.0007313 -0.0518653 0.0661979 0.0155353 0.061785 -0.01898 0.0911813 -0.1017534 0.1388503 0.0830246 0.0192455 0.0397976 0.0784756 -0.0140904 0.009551 -0.016519 0.1599138 0.0502059 -0.0719501 -0.0082176 -0.0905241 0.0842715 -0.0135258 -0.0134137 -0.010366 0.1459592 -0.0115745 0.035337 0.0106025 0.0949772 0.0571147 -0.0207052 0.0219739 -0.0192341 0.1547396 0.0826522 -0.0105066 -0.0001349 -0.0274728 -0.1155939 -0.0490767 -0.0028413 -0.0485474 0.1459589 -0.09218 -0.0924864 -0.0106726 -0.0976751 0.0477225 -0.0178545 -0.0107408 -0.017522 0.1563058 0.0697399 -0.012389 -0.0012983 -0.0059293 -0.1274566 -0.0443737 -0.0000841 -0.045727 0.1197814 -0.002964 -0.0208295 -0.0484249 0.104756 0.0177216 -0.1027913 0.006159 -0.0576424 -0.0403804 -0.0698382 -0.0502783 0.0212773 -0.0840288 -0.0469854 0.1028244 0.024142 0.0657261 0.0481705 -0.1830452 0.0687477 0.0055961 0.0931916 0.1025379 0.0028306 -0.0180332 -0.008483 0.0836793 0.1314558 0.0292027 0.0188641 -0.0032086 -0.0298326 -0.1249397 -0.015226 -0.0798598 -0.0395468 0.0769843 -0.1082033 0.0512585 -0.0975107 -0.019735 0.0617337 0.0281977 0.0294163 0.0597244 unknown
polarizability: 202.3569901|17.9567252|166.2922972|4.4045939|17.0136708|70.3212882 unknown
InChI: InChI=1S/C12H11NO2/c1-2-15-12(14)10-7-8-13-11-6-4-3-5-9(10)11/h3-8H,2H2,1H3
charge 0 multiplicity 1
26 atoms
O  2.74721 0.585638 0.021263
O  1.91392 -1.560785 -0.297657
N  -2.129272 1.723977 0.382595
C  -0.879629 -0.408874 -0.035788
C  0.366092 0.325859 0.063227
C  -2.10798 0.355907 0.135629
C  -0.98913 -1.817636 -0.288326
C  0.314113 1.707312 0.313272
C  -3.37646 -0.303298 0.051263
C  1.702722 -0.338654 -0.089542
C  -2.24367 -2.429486 -0.364703
C  -3.446719 -1.674505 -0.194681
C  -0.944672 2.35906 0.464447
C  4.133944 0.037132 -0.091015
C  4.623674 -0.484158 1.262967
H  -0.075366 -2.400669 -0.418443
H  1.24062 2.279298 0.390481
H  -4.26973 0.313677 0.187143
H  -2.306331 -3.506184 -0.558225
H  -4.418649 -2.175651 -0.258699
H  -0.984091 3.437019 0.659248
H  4.134245 -0.761707 -0.852985
H  4.722149 0.900194 -0.441375
H  5.680015 -0.800261 1.178374
H  4.559873 0.301679 2.035224
H  4.029521 -1.354881 1.586504
