program: Gaussian 09
title: 000281227
version: EM64L-G09RevD.01
frameworkgroup: C1[X(C15H21N2O3P)]
method: RPBEPBE
basis: SDD
operation: Freq
keyword: #p
keyword: freq=noraman
keyword: PBEPBE/SDD
title: #p freq=noraman PBEPBE/SDD
converged: NO YES NO NO
title: Mulliken charges:
elementType: P O O O N N C C C C C C C C C C C C C C C H H H H H H H H H H H H H H H H H H H H H
charge: 1.265940 -0.484449 -0.546872 -0.593633 -0.145742 -0.035065 0.509740 0.406716 -0.294050 -0.246963 -0.433225 -0.346125 -0.371930 -0.368551 -0.220214 -0.244628 -0.643412 -0.644723 -0.658071 -0.646628 -0.178265 0.275473 0.231013 0.256574 0.242793 0.245551 0.218232 0.220743 0.233783 0.219838 0.223324 0.241208 0.241544 0.243404 0.222344 0.244220 0.240441 0.202477 0.231465 0.211328 0.213468 0.260924
chargesum: 0.00000
title: Mulliken charges with hydrogens summed into heavy atoms:
elementType: P O O O N N C C C C C C C C C C C C C C C
charge: 1.265940 -0.484449 -0.546872 -0.593633 -0.145742 -0.035065 0.509740 0.406716 -0.294050 0.028510 -0.202212 -0.089551 -0.129137 -0.123000 0.218761 0.208993 0.062664 0.065245 0.016312 0.039093 -0.178265
polarizability: 3.97878823e+02 1.46575660e+01 2.12200357e+02 1.99460691e+01 2.26265217e+01 1.53501922e+02
1716.lowfreq: -4.9201 -3.0519 -0.0013 -0.0010 -0.0004 1.7648 12.7381 22.0907 23.7458
frequency: 12.3030 22.0868 23.4605 33.6776 44.7141 53.8959 68.3086 70.3453 78.3290 95.1385 121.2068 122.4633 133.7186 145.0894 172.5460 179.6627 191.6657 198.4694 227.2277 242.2127 251.5203 256.3943 268.9807 307.2315 313.9841 342.5869 368.1397 383.5688 402.3007 426.6542 432.2559 454.4584 476.3111 503.7103 526.5804 535.0978 612.4052 626.4687 628.9591 674.6325 710.7768 744.1418 766.8611 799.0667 807.5450 810.1337 815.3217 830.9136 862.0731 878.5335 939.4589 941.2895 973.8564 975.3105 991.4686 1008.6059 1017.2836 1021.9600 1046.9955 1054.4225 1094.8146 1103.4912 1105.4085 1112.3588 1133.8972 1143.8582 1146.1908 1167.0780 1210.7158 1252.8476 1255.0735 1255.6495 1271.0766 1326.7927 1352.5571 1356.3153 1357.8414 1375.2537 1388.5174 1393.1302 1394.7429 1431.1483 1456.3652 1456.8661 1459.9623 1460.6009 1465.6221 1465.9794 1476.9827 1478.9153 1485.2449 1488.7225 1491.0088 1503.9429 1527.3340 1543.6544 1578.0274 1633.0938 2139.2036 2954.0078 2960.8438 2976.4043 2985.5862 2994.3214 3008.1183 3024.5163 3028.6814 3039.0895 3075.5697 3081.5040 3091.0370 3105.0875 3108.5463 3110.0497 3110.5487 3115.1854 3122.9690 3161.4863 3169.9903 3183.4454
redmass: 4.4316 3.3490 3.0822 3.3805 4.2637 2.6759 3.2643 2.5365 2.3931 4.1430 4.5467 2.1726 2.5479 5.4702 3.1087 3.4038 1.1946 4.0633 3.1864 1.7954 1.6336 1.8155 3.1744 5.6598 4.6679 6.4248 5.1128 4.0194 3.7974 3.9957 3.6076 4.8858 3.6503 8.2808 2.3897 4.0903 7.2238 7.2542 7.6830 6.3743 5.1650 3.4615 7.4462 1.1222 1.2890 1.0911 6.1963 1.7058 3.5295 3.9372 3.1075 1.3245 1.3929 1.4007 3.1798 3.3455 3.2388 3.4038 9.8980 1.5265 2.1546 1.2363 2.2223 1.3323 1.4264 1.5612 1.5589 1.6790 1.1747 2.6580 1.2432 1.7486 1.1156 1.6615 1.3023 1.3034 1.7762 2.9511 1.2471 1.2431 2.1534 1.1871 1.5974 1.0428 1.0436 1.9596 1.0740 1.0404 1.0538 1.0458 1.0536 1.0758 1.1412 1.1594 2.7239 4.9602 5.9670 6.1339 12.6145 1.0367 1.0389 1.0555 1.0360 1.0370 1.0605 1.1002 1.1025 1.1075 1.1039 1.0982 1.0980 1.0971 1.1037 1.0885 1.1018 1.0950 1.0895 1.0874 1.0934 1.0958
irintensity: 0.7864 1.0314 0.5099 0.5882 0.3458 0.8623 1.2145 3.1135 0.4801 2.6593 1.8882 4.7003 0.4653 2.2385 4.8568 0.6941 0.1092 12.9091 2.0418 0.3300 0.7167 11.4522 10.5099 1.6857 0.5411 25.1503 11.2660 2.1082 2.8077 17.3407 6.4283 14.0684 5.6105 94.4954 14.6600 1.2248 102.8906 19.2899 65.0854 120.1609 14.0594 0.8706 10.3818 2.8381 6.4198 1.6936 22.5930 64.8271 158.6273 152.2955 37.1469 4.7563 4.8699 2.4997 2.6600 159.3840 153.8351 15.3456 143.5103 25.7791 14.6329 0.0130 12.2081 1.2245 4.8580 1.4927 10.7155 9.4924 170.1280 20.2128 1.4853 16.7977 0.2092 12.7505 28.0731 6.5742 5.1472 188.8755 33.6571 27.3773 109.6760 12.7714 60.3933 12.8751 11.5693 0.1466 5.3036 0.2005 5.5686 25.5625 13.2953 11.0744 7.4832 26.8326 466.6929 8.7231 427.9566 427.5652 65.2810 82.7063 133.5214 28.5737 21.2670 27.8194 39.3517 13.7074 55.0675 26.0361 8.5789 41.5953 26.1776 3.5091 25.2489 1.7873 32.6699 41.1690 6.3948 5.3109 17.5482 9.1436
temp: 298.150 k
press: 1.00000 atm
elementType: 15 8 8 8 7 7 6 6 6 6 6 6 6 6 6 6 6 6 6 6 6 1 1 1 1 1 1 1 1 1 1 1 1 1 1 1 1 1 1 1 1 1
symmnumber: 1
zpe: 880284.4 jmol-1
zpe.correction: 0.335283 hartree
zpe.thermalcorrener: 0.359945 hartree
zpe.thermalcorrenthalpy: 0.360889 hartree
zpe.thermalcorrgfe: 0.276789 hartree
zpe.sumelectzpe: -1258.957927 hartree
zpe.sumelectthermal: -1258.933265 hartree
zpe.sumelectthermalent: -1258.932320 hartree
zpe.sumelectthermalfe: -1259.016420 hartree
dipole: 9.4647 3.6810 5.8401
dipole: 11.7149
quadrupole: -93.9905 -130.2903 -141.9462
quadrupole: -6.7877 -15.3306 -3.1124
quadrupole: 28.0852 -8.2147 -19.8705 -6.7877 -15.3306 -3.1124
hfenergy: -1259.2932094 hartree
pointgroup: C01 [X(C15H21N2O3P1)]
dipole: -3.6558895 0.4756445 -2.7660415 debye
polarizability: 396.1416004|-13.3683534|184.3607637|26.5989253|-38.3495365|183.0787374 unknown
InChI: InChI=1S/C15H21N2O3P/c1-5-19-21(18,20-6-2)15(12-16)11-13-7-9-14(10-8-13)17(3)4/h7-11H,5-6H2,1-4H3
charge 0 multiplicity 1
42 atoms
P  3.20364 0.283359 0.416992
O  4.021671 -1.237181 0.222422
O  3.151943 0.98786 -1.181811
O  3.960405 1.166243 1.501129
N  -5.272508 0.298638 -0.415437
N  0.929212 -1.767037 2.640141
C  -0.997105 0.367464 -0.179651
C  -3.885007 0.322981 -0.343158
C  1.396897 -0.124742 0.647633
C  0.451224 0.46008 -0.181972
C  -1.705315 1.07122 -1.205303
C  -1.785585 -0.361712 0.766849
C  -3.100254 1.056592 -1.296103
C  -3.180712 -0.384023 0.691331
C  3.533097 -2.214802 -0.792226
C  4.200302 2.000473 -1.51664
C  -5.971229 1.036203 -1.480089
C  -6.055796 -0.446698 0.583952
C  4.4143 -3.451948 -0.641767
C  3.739695 3.410048 -1.138493
C  1.123916 -1.008439 1.730536
H  0.873839 1.091026 -0.976559
H  -1.131726 1.642452 -1.946106
H  -1.299687 -0.913617 1.575587
H  -3.58569 1.614655 -2.100826
H  -3.734785 -0.952387 1.442725
H  2.467989 -2.450771 -0.596938
H  3.620925 -1.762448 -1.798693
H  5.143792 1.74194 -1.000186
H  4.335976 1.882676 -2.605133
H  -7.056601 0.884633 -1.378346
H  -5.670084 0.681746 -2.485501
H  -5.77109 2.124746 -1.423555
H  -5.804083 -1.525312 0.577826
H  -7.127851 -0.347608 0.355289
H  -5.887536 -0.058787 1.60796
H  4.321774 -3.869218 0.374929
H  4.109016 -4.225427 -1.371145
H  5.472985 -3.197759 -0.818957
H  4.491655 4.152597 -1.466932
H  2.778652 3.65384 -1.624719
H  3.624535 3.493144 -0.044456
