program: Gaussian 09
title: 000281137
version: EM64L-G09RevD.01
frameworkgroup: C1[X(C5H5N3O)]
method: RPBEPBE
basis: SDD
operation: Freq
keyword: #pfreq=noraman
keyword: PBEPBE/SDD
title: #p freq=noraman PBEPBE/SDD
converged: NO NO NO NO
title: Mulliken charges:
elementType: O N N N C C C C C H H H H H
charge: -0.266546 -0.067890 -0.627009 -0.037522 0.235969 0.257976 0.015941 -0.748444 -0.216599 0.245542 0.261404 0.245524 0.344344 0.357311
chargesum: 0.00000
title: Mulliken charges with hydrogens summed into heavy atoms:
elementType: O N N N C C C C C
charge: -0.266546 -0.067890 0.074646 -0.037522 0.235969 0.257976 0.015941 0.004026 -0.216599
polarizability: 1.11511680e+02 5.70234109e+00 7.92132598e+01 4.55441613e-03 2.61536286e-04 3.70904032e+01
1716.lowfreq: 0.0007 0.0009 0.0011 3.8674 7.8949 10.1445 96.9430 130.0429 134.4880
frequency: 96.9137 130.0369 134.4801 199.3981 257.4717 292.0197 340.1854 386.7468 444.6758 507.3163 518.8163 576.9840 619.2607 625.8718 699.0963 768.9626 806.0051 959.3824 1015.8651 1046.4179 1126.3778 1141.3804 1264.6612 1400.2948 1409.5535 1453.2481 1462.7813 1587.0188 1609.0825 1664.5124 2168.5850 2995.4595 3074.2864 3128.6588 3563.7932 3706.8190
redmass: 1.1339 6.9940 3.5215 4.8228 2.7622 2.9231 1.2993 4.0114 1.2282 11.2056 8.2722 5.6474 6.9069 5.6543 11.8526 6.0419 8.1235 2.3740 2.2485 1.4319 3.5678 4.2274 4.6246 1.2457 6.0867 1.0434 1.0752 3.1195 1.7823 4.7084 12.5846 1.0378 1.0984 1.0980 1.0452 1.1053
irintensity: 0.1091 3.7388 1.8015 4.4980 9.0226 6.6169 16.8240 0.0526 328.6556 0.1038 1.2492 0.6562 3.5116 9.6388 0.8856 16.8464 18.4023 9.5123 12.7687 5.0163 43.0416 21.9279 16.5700 13.4893 20.0573 18.7724 13.9315 18.4777 45.8439 391.7308 102.8234 17.7278 11.9133 3.8735 131.5833 61.0120
temp: 298.150 k
press: 1.00000 atm
elementType: 8 7 7 7 6 6 6 6 6 1 1 1 1 1
symmnumber: 1
zpe: 258288.2 jmol-1
zpe.correction: 0.098377 hartree
zpe.thermalcorrener: 0.107107 hartree
zpe.thermalcorrenthalpy: 0.108051 hartree
zpe.thermalcorrgfe: 0.064918 hartree
zpe.sumelectzpe: -432.334042 hartree
zpe.sumelectthermal: -432.325312 hartree
zpe.sumelectthermalent: -432.324368 hartree
zpe.sumelectthermalfe: -432.367502 hartree
dipole: 3.5723 5.2539 0.0004
dipole: 6.3533
quadrupole: -55.4947 -47.8220 -52.8100
quadrupole: -12.1463 -0.0010 -0.0002
quadrupole: -3.4525 4.2202 -0.7677 -12.1463 -0.0010 -0.0002
hfenergy: -432.4324192 hartree
pointgroup: C01 [X(C5H5N3O1)]
dipole: -1.656484 -1.8718775 0.0010247 debye
dipolederiv: -0.7868499 0.1540449 0.0000889 0.1076234 -0.715191 0.0000962 0.0001422 0.0000812 -0.1203137 -0.0867735 -0.1644586 0.0000017 -0.2379337 -0.3260403 0.0001201 0.0000505 0.000016 -0.2046216 -0.279773 0.4517371 -0.0001869 0.2043242 -1.4199373 0.0001189 -0.0001375 0.0000499 -0.6994817 -0.6136836 -0.2070845 -0.0000099 -0.0437001 -0.2695122 -0.0000266 0.0001415 0.0000729 -0.2552828 0.4791229 -0.0037456 -0.0001112 -0.2852897 0.738557 -0.0001045 -0.0004857 -0.0000641 0.0235866 0.5205364 -0.2467765 0.0000255 0.0204674 1.7160524 -0.0003157 -0.000067 -0.0002661 0.2286072 -0.2762521 -0.4278169 0.000188 0.0787229 -0.3406053 0.0000061 0.0000614 0.0001498 -0.0126168 -0.1338057 0.0600756 -0.0000221 -0.0068192 -0.017327 0.0000802 0.0004144 -0.0000247 0.0830106 0.7265741 0.440007 -0.0001444 0.1854202 0.0027497 0.0000187 -0.0001956 -0.0000631 0.0497354 -0.0163369 0.0115018 0.0579862 -0.0133964 0.0921771 0.0788625 0.1101556 0.0490565 -0.0228902 0.0923501 -0.0308941 0.000082 0.0308924 -0.0559728 0.0002584 -0.000046 0.0002674 0.1376418 -0.0162847 0.0112364 -0.057992 -0.0138414 0.0918353 -0.0791821 -0.1101303 -0.0493567 -0.022316 0.1859601 0.0639212 0.0000299 0.0042392 0.287031 0.0000247 0.00005 0.0000244 0.4110232 0.2052157 -0.1117478 0.0000643 -0.0307091 0.2161833 0.0000432 0.0000465 0.0000566 0.4039179 unknown
polarizability: 112.4272585|1.451346|78.2976716|-0.02431|-0.0099512|37.0904129 unknown
InChI: InChI=1S/C5H5N3O/c1-3-8-4(2-6)5(7)9-3/h7H2,1H3
charge 0 multiplicity 1
14 atoms
O  -1.336108 -0.927052 0.000895
N  -0.435288 1.192763 0.000246
N  0.578676 -2.31922 0.000831
N  3.178443 0.767305 -0.000774
C  -1.562402 0.520048 0.000616
C  0.054183 -1.057967 0.000668
C  0.618858 0.227269 0.000293
C  -2.980272 0.968875 0.00095
C  1.999891 0.540279 -0.000038
H  -3.517711 0.602815 0.894027
H  -2.999592 2.069152 -0.000513
H  -3.518871 0.600351 -0.890399
H  -0.03234 -3.131422 0.001131
H  1.587233 -2.447594 0.000666
