program: Gaussian 09
title: 000281153
version: EM64L-G09RevD.01
frameworkgroup: C1[X(C11H11NO5)]
method: RPBEPBE
basis: SDD
operation: Freq
keyword: #p
keyword: freq=noraman
keyword: PBEPBE/SDD
title: #p freq=noraman PBEPBE/SDD
converged: YES YES NO NO
title: Mulliken charges:
elementType: O O O O O N C C C C C C C C C C C H H H H H H H H H H H
charge: -0.234721 -0.243289 -0.278706 -0.218250 -0.232785 -0.276922 0.473283 0.193733 -0.153165 -0.313932 -0.243982 -0.447863 -0.144308 0.171462 0.223855 -0.502530 -0.502177 0.264058 0.256176 0.237899 0.273295 0.242590 0.231896 0.249608 0.251717 0.244747 0.235114 0.243195
chargesum: 0.00000
title: Mulliken charges with hydrogens summed into heavy atoms:
elementType: O O O O O N C C C C C C C C C C C
charge: -0.234721 -0.243289 -0.278706 -0.218250 -0.232785 -0.276922 0.473283 0.193733 0.110893 -0.057755 -0.006083 -0.174568 0.098282 0.171462 0.223855 0.230691 0.220878
polarizability: 2.21807720e+02 -1.75611108e-01 1.54906929e+02 -1.60154475e+00 -8.86186982e+00 8.81613915e+01
1716.lowfreq: -7.4043 -5.4232 -4.6068 -0.0012 -0.0011 -0.0010 30.9841 51.6509 59.1021
frequency: 30.9193 51.6464 59.0860 65.4381 77.9407 89.4214 102.2089 107.7905 150.6971 159.1733 193.3511 209.3239 235.5165 253.1128 280.1068 290.1398 316.6746 329.9106 423.3453 467.1964 514.2176 539.7054 556.2254 601.3273 636.3880 664.0073 687.0601 716.5075 728.3878 757.9440 766.0270 802.2947 846.2687 862.0520 879.5975 912.5075 936.8603 967.9493 989.3535 1005.0328 1017.1928 1098.0757 1112.3816 1113.2975 1117.6797 1129.7032 1149.7105 1154.7495 1177.8004 1215.7863 1255.5040 1290.6213 1350.4603 1367.8461 1420.7558 1423.4030 1438.6034 1451.1204 1453.8602 1459.8721 1462.8410 1551.3451 1570.3952 1612.7699 1626.7138 1632.3813 1654.4319 3003.6546 3007.4033 3104.2322 3113.1196 3146.6301 3150.0051 3150.8100 3154.1624 3172.5158 3186.0059 3197.7742
redmass: 5.8578 4.8101 3.9988 3.0401 2.0048 1.5131 1.4903 3.0617 5.6331 6.0321 5.3468 6.3109 5.4814 6.3418 6.3837 4.5415 4.7580 6.5327 4.3635 6.0810 2.8766 7.7364 6.3746 6.6693 6.6077 4.8776 5.1075 6.4236 3.7308 1.4593 5.9660 5.9451 1.4943 5.8453 1.6543 6.7653 1.3733 7.9694 1.3139 3.6760 3.1067 3.1010 1.3396 1.2978 1.9324 1.8366 1.4459 1.4386 3.0846 1.6231 3.3760 2.0564 1.9129 1.7808 1.2015 1.2068 2.0842 1.0497 1.0495 1.0509 1.0519 7.6181 6.8228 9.0310 10.5431 8.7671 7.1639 1.0297 1.0291 1.1043 1.1050 1.0892 1.1046 1.0907 1.1048 1.0888 1.0955 1.1011
irintensity: 2.4467 2.1419 5.8785 2.8418 1.1005 0.2802 0.5397 0.3873 1.8931 0.8734 2.8260 6.1287 7.2066 4.3644 8.2641 10.5481 9.3476 23.3409 5.1076 11.0507 12.2725 3.4070 8.7215 8.9522 19.0853 2.4252 3.2564 24.2459 2.8812 96.9460 7.3558 6.9434 6.8594 28.8263 39.0483 0.0796 2.2499 40.3655 1.2373 20.5047 45.5895 115.1031 41.3080 3.2953 256.9442 111.2812 9.8874 2.6576 206.8567 9.5718 90.0556 43.7816 115.1570 25.1949 24.7860 29.8666 10.0743 13.5367 14.3430 9.0489 11.4712 61.9260 165.4193 247.9862 243.8109 130.4286 204.3429 36.9191 29.7019 24.7374 14.8314 14.7063 18.3083 6.9097 14.6775 0.1587 4.4251 6.1959
temp: 298.150 k
press: 1.00000 atm
elementType: 8 8 8 8 8 7 6 6 6 6 6 6 6 6 6 6 6 1 1 1 1 1 1 1 1 1 1 1
symmnumber: 1
zpe: 538070.3 jmol-1
zpe.correction: 0.204940 hartree
zpe.thermalcorrener: 0.221998 hartree
zpe.thermalcorrenthalpy: 0.222942 hartree
zpe.thermalcorrgfe: 0.158547 hartree
zpe.sumelectzpe: -855.366066 hartree
zpe.sumelectthermal: -855.349008 hartree
zpe.sumelectthermalent: -855.348063 hartree
zpe.sumelectthermalfe: -855.412459 hartree
dipole: 0.0633 -4.4014 -0.5205
dipole: 4.4325
quadrupole: -73.0922 -87.1865 -106.3470
quadrupole: 7.0755 -3.9463 -4.4698
quadrupole: 15.7830 1.6888 -17.4718 7.0755 -3.9463 -4.4698
hfenergy: -855.5710059 hartree
pointgroup: C01 [X(C11H11N1O5)]
dipole: -0.0562856 -1.7421842 0.0521334 debye
polarizability: 221.7917324|-0.9049876|152.8546223|-1.5418023|14.5878834|90.2296857 unknown
InChI: InChI=1S/C11H11NO5/c1-16-10(14)7-8(11(15)17-2)12-6-4-3-5-9(12)13/h3-7H,1-2H3
charge 0 multiplicity 1
28 atoms
O  -1.107799 1.925477 0.853643
O  1.866077 1.456554 1.354847
O  -3.222743 -1.849907 0.592181
O  0.115726 1.948326 -1.139908
O  -3.024546 0.218061 -0.479599
N  1.322582 -0.493618 0.14514
C  -0.056804 -0.102037 0.15659
C  2.284038 0.40363 0.786199
C  1.716459 -1.686045 -0.465235
C  3.665766 -0.045834 0.72839
C  3.038432 -2.084026 -0.479656
C  -1.04726 -1.035186 0.284562
C  4.030165 -1.243372 0.135519
C  -0.311985 1.367112 -0.11629
C  -2.487305 -0.766412 0.082112
C  -1.495193 3.335726 0.621028
C  -4.692806 -1.73313 0.4566
H  0.92794 -2.252883 -0.96528
H  4.396859 0.61833 1.196627
H  3.313494 -3.012129 -0.984971
H  -0.799509 -2.069823 0.54471
H  5.082003 -1.5489 0.120824
H  -2.027966 3.632954 1.534365
H  -2.152396 3.394307 -0.262661
H  -0.5949 3.9522 0.462836
H  -5.056772 -0.85008 1.008431
H  -5.089995 -2.662087 0.888504
H  -4.972464 -1.634007 -0.606008
