program: Gaussian 09
title: 000025401
version: EM64L-G09RevD.01
frameworkgroup: C1[X(C21H25NO2)]
method: RPBEPBE
basis: SDD
operation: Freq
keyword: #p
keyword: freq=noraman
keyword: PBEPBE/SDD
title: #p freq=noraman PBEPBE/SDD
converged: NO YES NO NO
title: Mulliken charges:
elementType: O O N C C C C C C C C C C C C C C C C C C C C C H H H H H H H H H H H H H H H H H H H H H H H H H
charge: -0.262715 -0.225513 -0.093932 -0.370882 -0.362619 -0.391980 -0.404700 -0.012737 -0.401823 -0.318015 -0.764347 0.275837 0.127037 -0.361989 -0.340572 0.009789 -0.229210 -0.258741 0.333929 -0.323198 -0.368263 -0.230222 -0.241214 -0.235314 0.173114 0.196832 0.237589 0.166830 0.190588 0.203414 0.215065 0.189943 0.179464 0.213871 0.188204 0.206649 0.213591 0.223862 0.263988 0.217894 0.251578 0.264784 0.226931 0.232527 0.242584 0.272380 0.221866 0.229356 0.228492
chargesum: 0.00000
title: Mulliken charges with hydrogens summed into heavy atoms:
elementType: O O N C C C C C C C C C C C C C C C C C C C C C
charge: -0.262715 -0.225513 -0.093932 -0.000937 0.041801 0.002022 0.000308 0.166728 0.000252 0.102225 -0.058604 0.275837 0.127037 -0.110411 -0.075788 0.009789 -0.002279 -0.026215 0.333929 -0.080615 -0.095883 -0.008357 -0.011858 -0.006822
polarizability: 2.83267823e+02 -3.01436418e+01 2.54138076e+02 5.12890425e+00 2.10237787e+01 1.76168850e+02
1716.lowfreq: -7.3551 -5.1475 -0.0009 -0.0006 0.0002 4.5650 17.5483 31.1075 33.3027
frequency: 14.1067 30.9554 32.8186 36.0716 57.7671 65.4142 84.5319 93.7133 126.1838 136.1754 175.7896 188.2114 199.9014 213.9196 255.6990 257.8662 271.0920 287.4604 312.8809 331.5085 354.9992 379.7719 399.6872 401.9689 428.2602 436.6396 444.5836 448.5689 469.5219 510.4197 527.8745 542.6679 582.4998 614.8150 620.3144 644.3593 685.2344 696.7534 708.1549 711.9237 752.5523 759.5237 800.9614 804.8918 809.6842 841.0060 853.6048 854.8821 855.5544 882.0998 912.4041 915.1503 932.7465 941.4471 948.9829 956.8167 959.1959 972.1576 980.6493 984.3701 990.3376 999.9179 1025.3160 1026.7961 1049.8396 1053.8160 1072.9466 1079.0103 1082.7125 1101.5447 1118.0921 1123.8598 1142.7665 1150.6817 1153.4589 1159.6249 1171.6456 1176.2356 1185.0319 1219.1437 1234.6297 1240.5025 1256.8779 1258.3702 1271.9819 1293.0751 1295.8912 1315.0680 1319.8742 1330.4231 1335.8156 1341.5548 1350.9411 1357.4373 1366.2434 1382.7305 1385.2464 1388.3700 1397.3714 1428.8771 1435.8648 1449.8746 1455.5713 1457.9309 1461.5009 1467.0114 1474.6542 1477.5086 1480.0709 1485.8335 1488.3478 1531.8380 1580.4213 1590.2077 1603.1869 1609.9913 2807.7559 2808.6185 2825.8086 2958.2277 2966.7901 2984.8735 2987.6216 2998.4239 3020.8963 3028.1288 3033.0035 3045.7369 3055.0935 3071.9974 3087.5985 3110.9787 3123.7062 3132.4909 3136.4635 3148.1774 3148.7666 3159.7610 3163.7788 3168.1013 3173.6111
redmass: 4.2596 5.0020 4.1426 4.1941 3.5048 4.7911 4.8496 3.8710 3.4970 4.2049 5.1437 3.6653 3.6498 2.4391 5.1252 2.4147 2.2639 4.3633 1.4210 1.9592 5.9389 1.7162 4.0225 3.0308 3.1775 3.6817 2.9799 2.7708 4.0951 3.7227 2.1858 2.8462 4.7424 6.4449 5.7166 4.6651 4.1768 1.7097 4.2580 2.9537 2.8127 1.3364 3.2706 1.4687 3.3684 3.1122 1.4327 1.2613 1.5164 2.8170 3.3311 2.9111 2.1563 1.4608 1.5030 1.4269 1.8354 2.2291 1.3444 1.4084 5.7594 1.3350 2.1967 2.1178 2.1859 1.9328 1.6668 1.7798 1.5898 2.5437 2.4132 2.1977 1.8684 1.3987 1.9679 1.8827 1.0594 1.0851 1.1448 3.2329 1.5181 1.4360 1.7514 1.4089 1.1769 1.2905 2.0321 1.3807 1.5621 1.3351 1.4062 1.4643 1.4826 1.3993 2.0815 2.2748 1.4740 7.9169 1.2432 2.2722 2.3117 1.0902 1.2207 1.0882 1.0988 1.1284 1.3768 2.0777 1.3688 1.0757 1.0895 10.2705 6.9689 6.3939 6.1858 6.1495 1.0762 1.0741 1.0723 1.0577 1.0625 1.0611 1.0614 1.0365 1.0900 1.1003 1.0957 1.1031 1.1027 1.0888 1.0972 1.1009 1.0849 1.0860 1.0885 1.0899 1.0928 1.0958 1.0939 1.1004 1.0993
irintensity: 0.4769 1.9493 0.4448 0.2572 0.5085 1.4572 1.3573 0.8463 1.5393 0.6178 0.9884 0.8484 0.8720 0.7935 3.3774 1.4666 2.1824 0.5761 1.2978 0.8009 2.1462 2.2331 1.3758 0.5918 3.3681 0.9300 0.8455 3.7189 1.5218 5.6101 2.5474 2.9378 1.0140 0.0063 8.1072 24.6613 0.8080 84.7275 7.9410 10.5165 42.9026 59.9391 4.7317 0.1812 21.0048 0.1509 3.7926 1.0745 0.0399 13.1491 15.3600 28.8997 42.4521 1.8075 15.1284 7.8874 49.9515 12.6470 2.3911 2.6935 0.8231 0.8383 2.8610 8.6703 11.8218 8.4322 9.8241 3.6081 8.7204 33.8440 7.8107 7.0490 4.9108 5.3464 15.8726 11.2438 0.1010 11.8100 15.8835 185.2899 13.5245 21.8391 45.9603 21.7806 8.2476 1.0481 194.9271 20.4138 10.6930 18.5079 23.5889 2.3593 1.3142 4.4606 0.8919 10.8373 0.7672 8.6746 17.0370 48.1833 55.6404 5.5841 42.1109 14.4010 11.3603 27.3052 9.6771 1.7028 25.3604 1.8219 5.0932 141.0549 26.8508 13.0197 114.5960 8.1403 19.1572 60.0019 261.8251 54.3242 43.9719 33.2316 30.2374 20.6860 61.8085 31.0357 60.4039 23.7671 94.9667 31.3723 31.5373 20.7601 0.0895 4.5919 11.0254 10.4970 16.9170 24.8215 21.4812 16.5812 17.9277
temp: 298.150 k
press: 1.00000 atm
elementType: 8 8 7 6 6 6 6 6 6 6 6 6 6 6 6 6 6 6 6 6 6 6 6 6 1 1 1 1 1 1 1 1 1 1 1 1 1 1 1 1 1 1 1 1 1 1 1 1 1
symmnumber: 1
zpe: 1078613.2 jmol-1
zpe.correction: 0.410822 hartree
zpe.thermalcorrener: 0.432864 hartree
zpe.thermalcorrenthalpy: 0.433808 hartree
zpe.thermalcorrgfe: 0.357722 hartree
zpe.sumelectzpe: -1018.636674 hartree
zpe.sumelectthermal: -1018.614632 hartree
zpe.sumelectthermalent: -1018.613688 hartree
zpe.sumelectthermalfe: -1018.689775 hartree
dipole: -4.1423 -3.1429 -0.8980
dipole: 5.2766
quadrupole: -145.0257 -131.2816 -141.9263
quadrupole: -11.3695 -7.1658 -0.5222
quadrupole: -5.6145 8.1296 -2.5151 -11.3695 -7.1658 -0.5222
hfenergy: -1019.0474963 hartree
pointgroup: C01 [X(C21H25N1O2)]
dipole: 1.4297764 0.9212111 -1.1902871 debye
polarizability: 288.2249172|-31.0551477|209.8974486|3.4167444|-39.4569964|215.4523825 unknown
InChI: InChI=1S/C21H25NO2/c1-17(22-14-8-3-9-15-22)16-24-20-13-7-6-12-19(20)21(23)18-10-4-2-5-11-18/h2,4-7,10-13,17H,3,8-9,14-16H2,1H3
charge 0 multiplicity 1
49 atoms
O  -0.720385 1.161262 0.118537
O  -3.12786 -1.125377 2.319345
N  2.340234 1.225588 -0.475522
C  2.855072 1.824321 -1.736077
C  3.444554 0.588316 0.287855
C  3.517308 0.765611 -2.641316
C  4.132197 -0.509657 -0.55138
C  1.496155 2.201279 0.285376
C  4.661453 0.052595 -1.888341
C  0.090026 2.299934 -0.345362
C  1.379341 1.902856 1.794673
C  -2.037991 1.062178 -0.336171
C  -2.840666 0.031463 0.244373
C  -2.604191 1.952056 -1.286768
C  -4.206847 -0.051809 -0.126223
C  -2.367553 -0.913672 1.321079
C  -3.957729 1.818601 -1.662906
C  -4.768701 0.817322 -1.083241
C  -1.076018 -1.665445 1.19448
C  -0.427442 -1.853516 -0.053227
C  -0.538423 -2.278703 2.358704
C  0.733325 -2.650184 -0.13674
C  0.632143 -3.058251 2.278214
C  1.268614 -3.250458 1.027055
H  3.602824 2.633763 -1.513137
H  2.020358 2.303613 -2.280425
H  3.032916 0.132717 1.202441
H  4.21757 1.342244 0.598828
H  3.894717 1.252566 -3.561339
H  2.750943 0.024875 -2.940669
H  3.391842 -1.307715 -0.749985
H  4.955717 -0.954151 0.040722
H  1.936258 3.230535 0.184738
H  5.093857 -0.755193 -2.50872
H  5.47678 0.778427 -1.687478
H  -0.403574 3.242554 -0.02668
H  0.155085 2.283463 -1.450228
H  2.349739 2.013453 2.307208
H  0.985594 0.888625 1.970122
H  0.673076 2.618003 2.253885
H  -2.004132 2.753649 -1.725456
H  -4.819427 -0.816563 0.362515
H  -4.379013 2.509286 -2.40217
H  -5.821674 0.721556 -1.36585
H  -0.83573 -1.385051 -0.953986
H  -1.064502 -2.137901 3.30882
H  1.220914 -2.802419 -1.105963
H  1.045008 -3.5228 3.180569
H  2.173938 -3.865147 0.960621
